{"text_format":"1","workbook":"xlsx","n_sheets":3,"sheets":["MENU","EJEMPLO_OAP","FORMATO PLAN DE ACCIÓN"],"not_rendered":{"charts":0,"images":4,"macros":1,"external_links":0,"defined_names":56,"comments":1,"pivot_tables":0},"unopened":[],"bounds":{"document_bytes":16777216,"sheet_cells":100000,"rows_first":2000,"rows_last":500,"rows_between":2000,"halvings":0,"cell_chars":16384,"cell_head_chars":4096},"cells_cut":0,"cells_raw":0,"read":"whole","date_system":"1900"}

{"sheet":"MENU","index":0,"n_rows":1121,"n_cols":80,"rows_kept":1121,"cut":false,"hidden":true,"merged":[]}
["ID_PAC","PACTO","ID_PAC","ID_LIN","LÍNEAS ESTRATÉGICAS","ID_PAC","ID_LIN","ID_OBJ","OBJETIVOS","ID_PAC","ID_LIN","ID_OBJ","ID_EST","ESTRATEGIAS","ID_CAP","ID_LIN","ID_EST","ID_OBJ","ID_ACT","ESTRATEGIAS SECTORIAL /INSTITUCIONAL ",null,null,"ID_DEP","DEPENDENCIA","RESPONSABLES","ID_DEP","ID_FTE","FUENTE_FINANCIACIÓN","EJECUTA","EJECUTA","ID_PROY","PROYECTO","ID_PROY","ID_PROD","PRODUCTO","REGIÓN PND","GRUPO POBLACIONAL","GENERO","FUENTE DEL COMPROMISO ÉTNICO","GRUPO ETNICO","APLICA/NO APLICA","POLÍTICA AMBIENTAL","PROCESO","CLASIFICACIÓN DE INDICADOR DESEMPEÑO Y CALIDAD","PLAN_DECRETO_612/2018","UNIDAD_MEDIDA","META_TRANSFORMACIONAL","META_PND","CONPES","ODS","CRECIMIENTO_VERDE",null," AGENDA POST-ACUERDO","OCDE","PACTOS_ETNICOS","PACTOS_REGIONALES","MIPG","DDHH",null,"ID_DEP","DEPENDENCIA","CONTRUCCIÓN DE PAZ","CRIC\nCAUCA","INDIGENAS CALDAS\nCRIDEC","INDIGENAS HUILA\nCRIHU","INDIGENAS","AFROS","ROM","MUJER","DEPARTAMENTO","MUNICIPIO","PARTICIPACIÓN GRUPOS DE VALOR","CATEGORÍAS (GPA)","DESCRIPCIÓN\nCATEGORÍAS (GPA)",null,null,"PROCESO_L","CÓDIGO ÚNICO DEL PROCESO/TUTELA","DESCRIPCIÓN","ÁREAS TÉCNICAS ENCARGADAS"]
[11,"I. Pacto por la legalidad: seguridad efectiva y justicia",1,1,"2.1. Campo con progreso: una alianza para dinamizar el desarrollo y la productividad de la Colombia rural",1,1,1,"2.1.1. Fortalecer las capacidades de gestión de riesgos sanitarios, fitosanitarios y de inocuidad de los alimentos, con énfasis en admisibilidad sanitaria y en el aprovechamiento de\nmercados externos",1,1,1,1,"No Aplica",1,1,1,1,1,"4.1.1.1.1 Implementar una estrategia para la reconversión de sistemas productivos agrícolas, pesqueros y ganaderos hacia modelos sostenibles y climáticamente inteligentes. ",null,null,20,"DAASU - Dirección Asuntos Ambientales Sectorial Urbano","Director(a) Asuntos Ambientales Sectorial Urbano",22,1,"DBBSE - REC15  - Conservación de la biodiversidad y los servicios ecosistémicos a nivel nacional.","DBBSE",4200000000,1,"Conservación de la biodiversidad y los servicios ecosistémicos a nivel nacional.",1,1,"3202-900-6-3202001-Documentos de lineamientos técnicos para la conservación de la biodiversidad y sus servicios eco sistémicos","Nacional","NO APLICA","NO APLICA","NO APLICA","NO APLICA","APLICA","NO APLICA","Administración del Sistema Integrado de Gestión","ECONOMIA","NO APLICA","Metros cuadrados","NO APLICA","NO APLICA","NO APLICA","NO APLICA","NO APLICA",null,"NO APLICA","NO APLICA","NO APLICA","NO APLICA","NO APLICA","ART13 - Igualdad en protección, trato de las autoridades y derechos. Adopción de medidas en favor de grupos discriminados o marginados",null,20,"DAASU ",0,0,0,0,100000000,0,0,0,"Nacional","EL ENCANTO","SI","CAPA1 - Protección del aire y del clima","Las actividades de protección del ambiente son aquellas cuyo propósito principal es la prevención, reducción y eliminación de la contaminación, o de cualquier otra degradación del ambiente. Incluye medidas adoptadas con el fin de restablecer el ambiente después de su degradación debido a presiones causadas por actividades humanas. Para considerarse como de protección del ambiente, las acciones y actividades deben cumplir el criterio del propósito principal; es decir, que debe ser el de protección del ambiente. Las acciones y actividades que tienen efectos favorables en el ambiente pero que están destinadas a otros fines no se consideran de protección ambiental. Por lo tanto, se excluyen de este campo aquellas actividades que, aunque lo benefician, satisfacen primordialmente necesidades técnicas o las prescripciones internas de higiene o seguridad de una empresa u otra institución.\n\n*Prevención de la contaminación mediante modificación de los procesos \n*Tratamiento de los gases de escape y el aire de ventilación \n*Medición, control, laboratorios y similares",null,null,"NO APLICA"]
[1,"II. Pacto por el emprendimiento, la formalización y la productividad: una economía dinámica, incluyente y sostenible que potencie todos nuestros talentos.",2,1,"3.1. Juventud naranja: todos los talentos cuentan para construir país",2,1,1,"3.1.1. Implementar una estrategia dirigida a los jóvenes que desarrolle actividades para fortalecer los proyectos de vida, las habilidades socioemocionales, la innovación y el\nliderazgo",2,1,1,1,"No Aplica",1,1,1,1,2,"4.1.1.1.2 Fortalecer el enfoque ambiental y de cambio climático del servicio de extensión agropecuaria mediante la incorporación y capacitación en mejores técnicas y prácticas que reduzcan impactos ambientales, así como el seguimiento y evaluación a las empresas prestadoras de este servicio.",null,null,21,"DAMCRA - Dirección Asuntos Marinos y Costeros","Director(a) Asuntos Marinos y Costeros",22,2,"DBBSE - REC11  - Conservación de la biodiversidad y los servicios ecosistémicos a nivel nacional.","DBBSE",37730185281,2,"Consolidación sistema de información ambiental SIAC como eje central de información ambiental oficial y soporte para la toma de decisiones a nivel regional y nacional y conocimiento en materia ambiental a nivel nacional y regional Bogotá.",1,2,"3202-900-6-3202002-Documentos de planeación para la conservación de la biodiversidad y sus servicios eco sistémicos","Amazonía","Adolescentes","Femenino","SENTENCIAS","Afros","NO APLICA","PGSS - Política para la Gestión Sostenible del Suelo","Administración del Talento Humano","EFICACIA","1.Plan Institucional de Archivos de la Entidad ­PINAR","Número","Reducir la tendencia de crecimiento de la deforestación proyectada por el IDEAM","Tasa de reciclaje y nueva utilización de residuos","3451 - Estrategia para el manejo ambiental de la cuenca Ubaté - Suárez","O3 - Porcentaje de estaciones que cumplen con el Oetivo intermedio III de las guías de calidad del aire de la Organización Mundial de la Salud (OMS) en material particulado inferior a 2.5 micras (PM2.5)","Porcentaje de avance  en el fortalecimiento de las capacidades para el Ministerio de Ambiente y Desarrollo Sostenible para atender los temas conexos con el acceso a recursos biológicos, genéticos y su derivados. ",null,"Zonificación ambiental que delimite la frontera agrícola y proteja las Áreas de Especial Interés Ambiental AEIA","Adoptar e implementar medidas necesarias para impedir actividades mineras en zonas protegidas","G28 - Concertar conjuntamente modelos de coordinación entre la autoridad de los pueblos indígenas y Parques Nacionales Naturales de Colombia para la planeación, el manejo y la gestión de las áreas del sistema de Parques Nacionales Naturales de Colombia, relacionadas con territorios colectivos de pueblos indígenas. ","Pacífico  - Objetivo 4. Mejorar la gestión ambiental de la región fortaleciendo el ordenamiento territorial ","P1 - G.E. Talento Humano","ART23 - Toda persona tiene derecho a presentar peticiones respetuosas a las autoridades por motivos de interés general o particular y a obtener pronta resolución. ",null,21,"DAMCRA ",0,0,0,0,0,0,0,0,"Regional","LA CHORRERA","NO","CAPA2 - Gestión de Aguas residuales ","La gestión de aguas residuales comprende las actividades y medidas orientadas a la prevención de la contaminación de las aguas superficiales mediante la reducción de las descargas de aguas residuales sobre las aguas superficiales y mares. Incluye la recolección y el tratamiento de aguas residuales, así como actividades de seguimiento y regulación. También se incluyen las fosas sépticas.\n\n*Prevención de la contaminación mediante modificación de los procesos \n*Redes de alcantarillado\n*Tratamiento de las aguas residuales\n*Tratamiento del agua de refrigeración \n*Medición, control, laboratorios y similares  ",null,null,"Afectación al Río Guarrojo - HOCOL","50001220400020150028500","TUTELA - Afectación al Río Guarrojo por exploración y explotación del empresa HOCOL - VILLAVICENCIO","DIRECCIÓN DE GESTIÓN DEL RECURSO HÍDRICO "]
[2,"III. Pacto por la equidad: política social moderna centrada en la familia, eficiente, de calidad y conectada a mercados",3,1,"4.1. Sectores comprometidos con la sostenibilidad y la mitigación del cambio climático\n",2,1,2,"3.1.2. Fortalecer la institucionalidad construida para favorecer la inclusión social, económica y política de los jóvenes",2,1,2,1,"3.1.2.1. Instancias y herramientas para la política de juventud",1,1,1,1,3,"4.1.1.1.3 Definir una metodología para focalizar y priorizar proyectos de adecuación de tierras que incluya la gestión del recurso hídrico, el uso de tecnologías eficientes y la planificación basada en información hidrometeorológica y de riesgos asociados con el cambio climático,",null,null,22,"DBBSE - Dirección Bosques, Biodiversidad y Servicios Ecosistémicos","Director(a) Bosques, Biodiversidad y Servicios Ecosistémicos",22,3,"DBBSE - REC21  - Conservación de cuencas hidrográficas abastecedoras de acueductos municipales a nivel Nacional.","DBBSE",8684412378,3,"Fortalecimiento de la estrategia de TI y transformación digital en el Ministerio de Ambiente y Desarrollo Sostenible nacional.",1,3,"3202-900-6-3202002-Documentos de planeación para la conservación de la biodiversidad y sus servicios eco sistémicos","Caribe","Desplazados","LGBTIQ","TODOS","Indígena",null,"PNGIBSE - Política Nacional para la gestión integral de la biodiversidad y sus servicios ecosistémicos.","Servicio al Ciudadano","EFICIENCIA","2.Plan Anual de Adquisiciones","Pesos","Visitantes a las áreas protegidas priorizadas en el Plan Maestro de Ecoturismo elaborado con Presidencia de la República (PNN Chingaza, PNN Tayrona, PNN Gorgona, PNN Los Nevados, PNN Utría, VP Isla de Salamanca y SFF Iguaque) administradas por Parques Nacionales Naturales con vocación ecoturística.","Residuos peligrosos y especiales sujetos a gestión posconsumo","3801 - Manejo Ambiental Integral de la Cuenca Hidrográfica del Lago de Tota","O3 - Porcentaje de estaciones que cumplen con el Oetivo intermedio III de las guías de calidad del aire de la Organización Mundial de la Salud (OMS) en material particulado inferior a 10 micras (PM10)","Porcentaje de avance en la formulación de una estrategia para posicionar la bioeconomía dentro de las Comisiones Regionales de Competitividad y los CODECTI, bajo las directrices del Comité Ejecutivo del SNCCTI",null,"Hectáreas en proceso de restauración afectadas con cultivos de uso ilícito ","Ajustar los estándares de calidad de aire según recomendaciones de OMS ","G29 - Parques Nacionales Naturales con un representante de cada uno de los comités de seguimiento establecidos en las consultas previas, presentará en el marco de la MPC y la CNTI un informe anual sobre el estado de cumplimiento de los acuerdos protocolizados en las consultas previas para la declaratoria de las áreas de parques nacionales y el estado de implementación de los Regímenes Especiales de Manejo-REM.  ","Caribe  - Objetivo 2. Garantizar el acceso y la calidad de los servicios públicos de imera necesidad que respondan a las particularidades geográficas de la región y oteger los ecosistemas","P2 -Integridad","ART38 - Libre asociación para el desarrollo de las distintas actividades que las personas realizan en sociedad.",null,22,"DBBSE ",0,0,0,0,12603000000,0,0,0,"Amazonas","LA PEDRERA",null,"CAPA3 - Gestión de residuos ","La gestión de residuos hace referencia a las actividades y medidas dirigidas a prevenir la generación de residuos y a reducir sus efectos nocivos para el ambiente. Comprende la recolección y tratamiento de residuos, incluidas las actividades de seguimiento y regulación. También comprende el reciclaje y el compostaje, la recolección y tratamiento de residuos radiactivos de bajo nivel, la limpieza de calles y la recolección de basura en la vía pública. \n\n*Prevención de la contaminación mediante modificaciones de los procesos \n*Recolección y transporte \n*Tratamiento y eliminación de residuos peligrosos \n*Tratamiento y eliminación de residuos no peligrosos \n*Medición, control, laboratorios y similares ",null,null,"Afectación fumigación de cultivos ilegales.","T-517.583\nSU - 383 DE 2003 ","TUTELA  - Protección transitoria de sus derechos fundamentales a la vida, existencia comunitaria, medio ambiente sano, libre desarrollo de la personalidad, debido proceso y derecho a la participación de los pueblos indígenas en las decisiones que los afectan, que estarían siendo quebrantados por los accionados al ordenar y autorizar la fumigación de cultivos ilegales, en sus territorios. - BOGOTA ","DASSU "]
[3,"IV. Pacto por la sostenibilidad: producir conservando y conservar produciendo",3,2,"4.2. Biodiversidad y riqueza natural: activos estratégicos de la Nación",3,1,1,"4.1.1. Avanzar hacia la transición de actividades productivas comprometidas con la sostenibilidad y la mitigación del cambio climático ",3,1,1,1,"4.1.1.1. Producción agropecuaria con prácticas sostenibles",1,1,1,2,1,"4.1.1.2.1 Formular e implementar una estrategia para fomentar el transporte sostenible en los modos de transporte terrestre, férreo y fluvial, considerando la infraestructura para su operación e incluyendo los instrumentos financieros para su desarrollo. ",null,null,23,"DCC - Dirección Cambio Climático Y  Gestión del  Riesgo","Director(a) Cambio Climático Y  Gestión del  Riesgo",22,4,"DBBSE - REC21  - Formulación administración de  los recursos FONAM para el uso sostenible y protección de las especies CITES nacional.","DBBSE",200000000,4,"Fortalecimiento de la gestión ambiental sectorial y urbana a nivel nacional",1,4,"3202-900-6-3202004-Documentos de investigación para la conservación de la biodiversidad y sus servicios eco sistémicos","Central","Desvinculados Grupos Armados","Masculino",null,"Palenquero",null,"PNHIC - Política Nacional para Humedales Interiores de Colombia","Contratación","EQUIDAD","3.Plan Anual de Vacantes","Porcentaje","Sembrar 180 millones de árboles","Reducción acumulada de las emisiones de Gases Efecto Invernadero, con respecto al escenario de referencia nacional*(T)","3803 - Política para la Preservación del Paisaje Cultural Cafetero de Colombia","O6 - Porcentaje de puntos de monitoreo con categoría buena o aceptable del Índice de Calidad de Agua (ICA)","Porcentaje de avance en la elaboración del marco conceptual para la elaboración de una cuenta satélite para la bioeconomía",null,"Opciones de generación de ingresos e Incentivos para las comunidades que colindan o viven en areas de manejo ambiental especial de acuerdo a las restricciones ambientales y la aptitud de uso del suelo \n\n(programa de reasentamiento, recuperación comunitaria de bosques, PSA, sistemas de producción alimentaria sostenibles y silvopastoriles, etc) ","Apoyar a MinVivienda en expedición de decreto sobre estándares mínimos operacionales en gestión de residuos","G50 - Construir e implementar programas relacionados con prevención del riesgo con ocasión de catástrofes naturales como consecuencia del cambio climático.","Caribe  - Objetivo 3. omover la inclusión social y la equidad ","P3 -Planeación Institucional","ART40 - Todo ciudadano tiene derecho a participar en la conformación, ejercicio y control del poder político (tomar parte en participación democrática, interponer acciones públicas)",null,23,"DCC ",0,0,0,0,560000000,40000000,0,0,"Antioquia","LA VICTORIA",null,"CAPA4 - Protección y recuperación del suelo, aguas subterráneas y superficiales ","La protección y recuperación de suelos, aguas subterráneas y aguas superficiales hace referencia a las medidas y actividades dirigidas a prevenir la filtración de contaminantes, a limpiar suelos y cuerpos de agua y a proteger el suelo contra la erosión, la salinización y otras formas de degradación física. Se incluye la vigilancia y el control de la contaminación del suelo y las aguas subterráneas.\n\n*Prevención de la filtración de contaminantes \n*Limpieza del suelo y los cuerpos de agua \n*Protección del suelo contra la erosión y otras formas de degradación física \n*Prevención y recuperación de la salinidad del suelo \n*Medición, control, laboratorios y similares ",null,null,"Agua potable - San Estanislao en Bolívar","13001233300020110011700","ACCIÓN POPULAR - Suministro de agua potable al municipio de San Estanislao en Bolívar - CARTAGENA","SIN IDENTIFICAR"]
[5,"V. Pacto por la Ciencia, la Tecnología y la Innovación: un sistema para construir el conocimiento de la Colombia del futuro",3,3,"4.3. Colombia resiliente: conocimiento y prevención para la gestión del riesgo de desastres y la adaptación al cambio climático",3,1,2,"4.1.2. Mejorar la calidad del aire, del agua y del suelo para la prevención de los impactos en la salud pública y la reducción de las desigualdades relacionadas con el acceso a recursos",3,1,1,2,"4.1.1.2. Transporte sostenible",1,1,1,2,2,"4.1.1.2.2 Formular el programa de reemplazo de la flota oficial a vehículos eléctricos e híbridos. ",null,null,24,"DGIRH - Dirección de Gestión Integral del Recurso Hídrico","Director(a) de Gestión Integral del Recurso Hídrico",20,1,"DAASU - REC11  - Fortalecimiento de la gestión ambiental sectorial y urbana a nivel nacional.","DAASU",2918707883,5,"Fortalecimiento de la gestión de cambio climático en la planeación sectorial y territorial  nacional.",1,5,"3202-900-6-3202040-Servicio de asistencia técnica para la protección de la fauna y flora silvestre","Eje Cafetero/Antioquia","Discapacitados","Todos",null,"Raizal",null,"PNEA - Política Nacional de Educación Ambiental – SINA","Evaluación Independiente","SOSTENIBILIDAD AMBIENTAL","4.Plan de Previsión de Recursos Humanos",null,null,"Puntos de monitoreo con Índice de Calidad de Agua (ICA) malo**","3810 - Política para el suministro de agua potable y saneamiento básico en la zona rural","O6 - Porcentaje de subzonas hidrográficas con Índice de Uso del Agua (IUA) muy alto o crítico","Número de expediciones científicas con fines de bioprospección en zonas continentales y marinas con alta concentración de biodiversidad realizadas ",null,null,"Asegurar la implementación de planes de manejo de cuencas y su integración a planes de uso del suelo","G7 - Concertar el instrumento normativo pertinente para crear y regular la categoría de Área de Conservación Indígena y su integración al Sistema Nacional de Áreas Protegidas –SINAP-.","Caribe  - Objetivo 4. Desarrollar el potencial oductivo agropecuario, cultural y turístico en conjunto con la investigación en ciencia y tecnología y el desarrollo ambiental sostenible","P4 -Gestión presupuestal y eficiencia del gasto público","ART63 - Los bienes de uso público, parques naturales, tierras grupos étnicos, tierras de resguardo y el patrimonio arqueológico de la Nación son inalienables, imprescriptibles e inembargables.",null,24,"DGIRH ",0,0,0,0,0,0,0,0,"Arauca","LETICIA",null,"CAPA5 - Reducción del ruido  ","La atenuación de ruidos y vibraciones hace referencia a las medidas y actividades tendientes a controlar, reducir y atenuar los ruidos y vibraciones industriales y del transporte. Se incluyen las actividades tendientes a atenuar los ruidos del vecindario (aislación acústica de salas de baile, etc.), así como para atenuar el ruido en lugares frecuentados por el público (piscinas de natación, etc.), escuelas, etc.\n\n*Modificaciones preventivas de los procesos en la fuente \n*Construcción de instalaciones contra el ruido y las vibraciones \n*Medición, control, laboratorios y similares ",null,null,"Agua potable corregimiento de Saladito","76001333300420150013600","ACCION POPULAR - Falta de agua potable corregimiento de Saladito - CALI","N/A"]
[6,"VI. Pacto por el transporte y la logística para la competitividad y la integración regional.",3,4,"4.4. Instituciones ambientales modernas, apropiación social de la biodiversidad y manejo efectivo de los conflictos socioambientales",3,1,3,"4.1.3. Acelerar la economía circular como base para la reducción, reutilización y reciclaje de residuos",3,1,1,3,"4.1.1.3. Reconversión tecnológica para una industria sostenible y baja en carbono",1,1,1,2,3,"4.1.1.2.3 Ajustar los programas de desintegración y renovación del parque automotor de buses de servicio público y camiones, y gestión de la incorporación de vehículos limpios en sistemas de transporte público cofinanciados por la Nación. ",null,null,25,"DOAT - Dirección de Ordenamiento Ambiental Territorial SINA","Director(a) de Ordenamiento Ambiental Territorial -SINA",20,2,"DAASU - REC11  - Implementación de las estrategias, instrumentos y recomendaciones de la OCDE en materia de gestión ambiental a nivel nacional.","DAASU",1536130338,6,"Fortalecimiento de la gestión institucional de la secretaría general del Ministerio de Ambiente y Desarrollo Sostenible.",2,1,"3204-900-10-3204004-Documento de lineamientos tecnicos para la gestión de la información y del conocimiento ambiental.","Llanos/Orinoquia","Jóvenes",null,null,"Rrom",null,"PNAOCI - Política nacional ambiental para el desarrollo sostenible de los espacios oceánicos y las zonas costeras e insulares de Colombia","Formulación y Seguimiento de Políticas Públicas Ambientales","VALORACIÓN DE COSTOS AMBIENTALES","5.Plan Estratégico de Talento Humano",null,null,"Porcentaje de estaciones de calidad del aire que registran concentraciones anuales por debajo de 30 μg/m3 de partículas inferiores a 10 micras (PM10)***","3819 - Política Nacional para la Consolidación del Sistema de Ciudades","O6 - Planes de Ordenación y Manejo de Cuencas Hidrográficas (POMCA) formulados en el territorio nacional","Porcentaje de avance de la construcción de un portafolio nacional de productos BIO de alto valor agregado, con base en avances existentes. ",null,null,"Desarrollar instrumentos económicos para incentivar reciclaje de papel","D1 - Concertar  el instrumento normativo pertinente para crear y regular la categoría de área de conservación indígena y su integración al Sistema Nacional de Áreas Protegidas –SINAP-.\n\nUna vez se cree la  categoría,  se priorizará su aplicación a la Sierra Nevada de Santa Marta.","Seaflower - Objetivo 1. Mejorar la ovisión de servicios públicos, en especial saneamiento básico, residuos, agua potable, energía y conectividad ","P5 -Fortalecimiento organizacional y simplificación de procesos","ART64 - Promoción del acceso progresivo a la propiedad de la tierra de los trabajadores agrarios, en forma individual o asociativa.",null,25,"DOAT ",200000000,0,0,0,500000000,100000000,0,0,"Atlántico","MIRITI - PARANA",null,"CAPA6 - Protección de la biodiversidad y los paisajes ","La protección de la biodiversidad y de los paisajes hace referencia a las medidas y actividades destinadas a la protección y rehabilitación de especies de la fauna y la flora, de los ecosistemas y hábitat, así como a la protección y rehabilitación de paisajes naturales e intervenidos. La distinción entre protección de la “biodiversidad” y los “paisajes” no siempre es posible. Por ejemplo, la creación o el mantenimiento de ciertos tipos de paisaje, biotipos y ecozonas y temas conexos (barreras o hileras de árboles destinados a restablecer “corredores naturales”) tienen una clara vinculación con la preservación de la biodiversidad.\n\n*Protección y rehabilitación de hábitat y especies \n*Protección de paisajes naturales e intervenidos seminaturales\n*Medición, control, laboratorios y similares ",null,null,"Alto Nápoles – Santiago de Vali – Valle del Cauca Nasa Ukawe sx' Thaj.","76001408800320100006400","ACCION DE TUTELA  - Desplazamiento forzado Alto Nápoles – Santiago de Vali – Valle del Cauca Nasa Ukawe sx' Thaj. - VALLE DEL CAUCA ","SIN IDENTIFICAR"]
[12,"VII. Pacto por la transformación digital de Colombia: Gobierno, empresas y hogares conectados con la era del conocimiento.",4,1,"9.1. Desarrollo minero-energético con responsabilidad ambiental y social",3,1,4,"4.1.4. Desarrollar nuevos instrumentos financieros, económicos y de mercado para impulsar actividades comprometidas con la sostenibilidad y la mitigación del cambio climático",3,1,1,4,"4.1.1.4. Provisión de edificaciones e infraestructura sostenible",1,1,1,2,4,"4.1.1.2.4 Optimizar el procedimiento de reducción de arancel para la importación de vehículos limpios.",null,null,26,"GCOM - Grupo de Comunicaciones","Jefe(a) Grupo de Comunicaciones",20,3,"DAASU - REC15  - Implementación de las estrategias, instrumentos y recomendaciones de la OCDE en materia de gestión ambiental a nivel nacional.","DAASU",800000000,7,"Fortalecimiento de la oferta institucional para la sostenibilidad ambiental del territorio en el marco de los negocios verdes y sostenibles.",2,2,"3204-900-10-3204054-Documentos de politica para la gestión de la información y el conocimiento ambiental.","Océanos","Niños",null,null,"Negros",null,"PGAU -Política Gestión Ambiental Urbana","Gestión  Financiera",null,"6.Plan Institucional de Capacitación",null,null,"Áreas bajo esquemas de Pagos por Servicios Ambientales (PSA) e incentivos a la conservación","3849 - Estrategias para rendir honores a la desaparecida ciudad de Armero y a sus víctimas: Ley 1632 de 2013","O6 - Planes de Ordenación y Manejo de Cuencas Hidrográficas (POMCA) en implementación en el territorio nacional","Número de departamentos implementando proyectos de Turismo Científico de Naturaleza.",null,null,"Desarrollar plan coordinado para reducir deforestación proveniente de ganadería \n","E51 - Concertar conjuntamente modelos de coordinación entre la autoridad de los pueblos indígenas y parques nacionales de Colombia para la planeación, el manejo y la gestión de las áreas del sistema de parques nacionales naturales de Colombia relacionadas con territorios colectivos de pueblos indígenas.","Seaflower - Objetivo 2. Implementar medidas de adaptación al cambio climático y omover el cuidado del ambiente teniendo en cuenta la otección al ecosistema y el uso de fuentes de energía alternativas ","P6 -Gobierno Digital","ART70 - Promoción de la investigación, la ciencia, el desarrollo y la difusión de los valores culturales de la Nación.",null,26,"GCOM",0,0,0,0,0,0,0,0,"Bogotá","PUERTO ALEGRIA",null,"CAPA7 - Protección contra la radiación (excepto seguridad extrema)","La protección contra las radiaciones hace referencia a actividades y mediciones orientadas a reducir o eliminar las consecuencias negativas de radiaciones emitidas por cualquier fuente. Se incluye la manipulación, el transporte y el tratamiento de residuos de alto nivel radiactivo, es decir, de aquellos que por su alto contenido de radionucleidos exigen protección durante su normal manipulación y transporte.\n\n*Protección del entorno\n*Transporte y tratamiento de residuos de alto nivel radiactivo\n*Medición, control, laboratorios y similares ",null,null,"Ampliación corredor vial Girón-Lebrija-derrumbe de talud","68001233300020130092300","ACCION POPULAR - Ampliación corredor vial Girón-Lebrija-derrumbe de talud - BUCARAMANGA","DIRECCION SINA"]
[7,"VIII. Pacto por la calidad y eficiencia de servicios públicos: agua y energía para promover la competitividad y el bienestar de todos",4,2,"9.2. Seguridad energética para el desarrollo productivo",3,2,1,"4.2.1. Implementar estrategias transectoriales para controlar la deforestación, conservar los ecosistemas y prevenir su degradación",3,1,1,5,"4.1.1.5. Compromiso sectorial con la mitigación del cambio climático",1,1,1,2,5,"4.1.1.2.5 Implementación del Plan Maestro Ferroviario y del Plan Maestro de Transporte Fluvial",null,null,27,"OAI - Oficina de Asuntos Internacionales","Jefe(a) de Oficina de Asuntos Internacionales",21,1,"DAMCRA - REC11  - Fortalecimiento fortalecer la gestión ambiental del estado colombiano sobre las zonas marinas y costeras y recursos acuáticos nacional.","DAMCRA",1953504444,8,"Fortalecimiento de los procesos de planeación, evaluación y seguimiento a la gestión adelantada por el sector ambiental.",2,3,"3204-900-10-3204055-Servicios de información para la gestión del conocimiento ambiental implementado.","Pacifico","Tercera Edad",null,null,"Todos",null,"PPCCA -Política de Prevención y Control de la Contaminación del Aire","Gestión de Comunicación  Estratégica",null,"7.Plan de Incentivos Institucionales",null,null,"Porcentaje de ecosistemas o unidades de análisis ecosistémicas no representados o subrepresentados incluidos en el SINAP en el cuatrienio","3850 - Fondo Colombia en Paz","O8 - Porcentaje de residuos sólidos efectivamente aprovechados","Porcentaje de avance en el proceso de ratificación del protocolo de Nagoya",null,null,"Diseñar Programa de Prevención de Accidentes Mayores en Colombia\n","E44 - Garantizar, de acuerdo al marco de cumplimiento de la sentencia STC 4360 de 2018  y lo que exige la Corte, la participación efectiva de los pueblos indígenas en la aplicación de sus derechos especiales, consagrados en el marco normativo de la nación, el cumplimiento de las órdenes que competen al MADS. ","Pacto para la región central - Objetivo 3. oteger la fábrica natural de agua del país ","P7 -Seguridad Digital","ART72 - El patrimonio cultural de la Nación está bajo la protección del Estado. Reglamentación de derechos especiales de los grupos étnicos en territorios de riqueza arqueológica.",null,27,"OAI ",0,0,0,0,0,0,0,0,"Bolívar","PUERTO ARICA",null,"CAPA8 - Investigación y desarrollo","La investigación y desarrollo (I&D) comprende trabajos creativos asumidos en forma sistemática con el fin de incrementar los conocimientos y su utilización para conseguir nuevas aplicaciones en el ámbito de la protección ambiental.",null,null,"Cabildo Central Kwe´sx Yu Kiwe","76001312100320180004400","SOLICITUD DE RESTITUCION Y FORMALIZACION DE DERECHOS TERRITORIALES - Reconoce como víctimas del conflicto armado interno colombiano al Cabildo Central Kwe´sx Yu Kiwe integrado por las 7 comunidades Altamira, Granates, La Rivera, Nuevo Horizonte, La Cumbre, El Salado, y Nueva Esperanza  - CALI ","SIN IDENTIFICAR"]
[4,"IX. Pacto por los recursos mineroenergéticos para el crecimiento sostenible y la expansión de oportunidades.",5,1,"5.1. Desarrollo de sistemas nacionales y regionales de innovación integrados y eficaces",3,2,2,"4.2.2. Realizar intervenciones integrales en áreas ambientales estratégicas y para las comunidades que las habitan",3,1,2,1,"4.1.2.1. Mejor calidad del aire para proteger la salud",1,1,1,2,6,"4.1.1.2.6 Implementar el Esquema de Compensación y Reducción de Carbono para la Aviación Internacional.",null,null,28,"OCI - Oficina de Control Interno","Jefe(a) de Oficina de Control Interno",24,1,"DGIRH - REC11  - Fortalecimiento institucional para la implementación de la política nacional para la gestión integral del recurso hídrico nacional.","DGIRH",3458775776,9,"Fortalecimiento en el control y seguimiento a los compromisos adquiridos en escenarios internacionales de la gestión ambiental.",2,4,"3204-900-10-3204056-Servicios tecnologicos para el sistema de información ambiental.","Santanderes","Campesinos",null,null,null,null,"RESPEL -Política Ambiental para la Gestión Integral de Residuos o Desechos Peligrosos","Gestión Del Desarrollo Sostenible",null,"8.Plan de Trabajo Anual en Seguridad y Salud en el Trabajo",null,null,"Negocios verdes verificados","3868 - Política de gestión del riesgo asociado al uso de sustancias químicas","O11 - Miles de hectáreas de áreas protegidas","Porcentaje de avance en el proceso de reglamentación NO CITES",null,null,"Diseñar Programa para la Gestión de Sustancias Químicas de Uso Industrial","G11 - Impulsar e implementar el programa Guarda Bosques Corazón del Mundo-GBCM y definir de manera concertada entre el Ministerio de Ambiente y los Pueblos de la Sierra, una estrategia de gestión de recursos para la protección de áreas estratégicas de sensibilidad ambiental, ecológica y social que contribuya a la conservación de la Sierra Nevada de Santa Marta.","Santanderes  - Objetivo 3. omoción de la conservación y uso sostenible del capital natural ","P8 -Defensa Jurídica","ART74 - Todas las personas tienen derecho a acceder a los documentos públicos salvo los casos que establezca la ley.",null,28,"OCI ",0,0,0,0,0,0,0,0,"Boyacá","PUERTO NARIÑO",null,"CAPA9 - Otras actividades de protección del medio ambiente ","Las otras actividades de protección ambiental hacen referencia a todas las actividades de protección del ambiente que toman la forma de actividades de administración y gestión generales o de formación o enseñanza orientadas específicamente a la protección del ambiente y que comprenden la información pública, cuando no están clasificadas en otro lugar de la CAPA. Se incluyen también las actividades que generan gastos indivisibles, así como las no especificadas en otra parte. \n\n*Administración y gestión general del ambiente \n*Educación, capacitación e información \n*Actividades que generan gastos indivisibles \n*Actividades no especificadas en otra parte ",null,null,"Calidad del aire","20001312100120140003300","ORDINARIO-RESTITUCION DE TIERRAS - Mejorar la calidad del aire a la comunidad - GUAJIRA","DAASU"]
[8,"XII. Pacto por la equidad de oportunidades para grupos étnicos: indígenas, negros, afrocolombianos, raizales, palenqueros y Rrom",6,1,"6.1. Corredores estratégicos intermodales: red de transporte nacional, nodos logísticos y eficiencia modal",3,2,3,"4.2.3. Generar incentivos a la conservación y pagos por servicios ambientales para promover el mantenimiento del capital natural",3,1,2,2,"4.1.2.2. Reducción de la presión y mejoramiento de la calidad del recurso hídrico",1,1,1,2,7,"4.1.1.2.7 Fomentar la movilidad urbana sostenible, mediante la implementación\nde las NAMA (Nationally Appropriate Mitigation Actions). en transporte para reducir viajes y priorizar modos no motorizados, incluyendo la bicicleta; y la definición de parámetros, con MinAmbiente, para la\nimplementación de la etiqueta vehicular.",null,null,29,"ONVS - Oficina de Negocios Verdes","Jefe(a) de Oficina de Negocios Verdes",25,1,"DGOAT - REC11  - Generación capacidades para el adecuado desempeño ambiental del SINA en el territorio nacional.","DGOAT",3070683464,10,"Fortalecimiento fortalecer la gestión ambiental del estado colombiano sobre las zonas marinas y costeras y recursos acuáticos nacional.",3,1,"3299-900-15-3299054-Documentos de Planeación","Seaflower","Comunidades",null,null,null,null,"PNGIRH - Política Nacional para la Gestión Integral del Recurso Hídrico","Gestión Disciplinaria",null,"9.Plan Anticorrupción y de Atención al Ciudadano",null,null,"Áreas bajo sistemas sostenibles de conservación (restauración*, sistemas agroforestales, manejo forestal sostenible)","3874 - Política nacional para la gestión integral de residuos sólidos.","O11 - Porcentaje de estaciones que cumplen con el Oetivo intermedio III de las guías de calidad del aire de la Organización Mundial de la Salud (OMS) en material particulado inferior a 2.5 micras (PM2.5)","Porcentaje de avance en al puesta en marcha de la una Agenda Nacional Integrada Forestal",null,null,"Establececimiento de marco para distribución de beneficios de recursos genéticos","G31 - Diseñar de manera concertada con las autoridades indígenas instrumentos orientadores de la planeación ambiental de los territorios indígenas y los mecanismos de articulación con los instrumentos de ordenamiento y planeación de los gobiernos territoriales y entidades del Sistema Nacional Ambiental SINA. ","Amazonia  - Objetivo 1. oteger y conservar los ecosistemas de la Amazonia como garantía para la equidad intergeneracional ","P9- Mejora normativa","ART78 - La ley regulará el control de calidad de bienes y servicios ofrecidos y prestados a la comunidad.",null,29,"ONVS ",68000000,0,0,0,510000000,5000000,5000000,0,"Caldas","PUERTO SANTANDER",null,"CREMA10 - Gestión de recursos minerales y energéticos","Incluye las acciones y actividades dirigidas a minimizar la utilización de recursos minerales y energéticos mediante modificaciones de los procesos, la recuperación, la reutilización, el reciclado, el ahorro y el empleo de recursos minerales sustitutos, la generación de energía de fuentes renovables y cualquier otro tipo de medida. También incluye las acciones y actividades referentes a la medición, el control, los laboratorios y similares, así como las actividades de educación, capacitación, información, administración y regulación.\n\n*Reducción del consumo de recursos minerales y energéticos \n*Reducción de la utilización de minerales mediante la disminución de los fragmentos, la producción y consumo de productos y materiales reciclados, la disminución de las pérdidas de calor y energía, y el ahorro de energía \n*Medición, control, laboratorios y similares relacionados con los recursos minerales y energéticos ",null,null,"Cerrejón - Cierre de tajos y botaderos cercanos la Resguardo Provincial","44001220400020170011700 (T-614 DE 2019)","ACCIÓN DE TUTELA (CERREJÓN) - Ordenar a Cerrejón el cierre de tajos y botaderos cercanos la Resguardo Provincial hasta tanto se desarrolle sistema de vigilancia epidemiológica o de monitoreo critico - RIOHACHA","DAASU"]
[9,"XIII. Pacto por la inclusión de todas las personas con discapacidad",7,1,"8.1. Energía que transforma: hacia un sector energético más innovador, competitivo, limpio y equitativo",3,2,4,"4.2.4. Consolidar el desarrollo de productos y servicios basados en el uso sostenible de la biodiversidad",3,1,2,3,"4.1.2.3. Gestión de pasivos ambientales y del suelo",1,1,1,3,1,"4.1.1.3.1 Establecer los lineamientos para incorporar sistemas de almacenamiento de energía en el sistema eléctrico, un mecanismo para la gestión activa de la demanda y armonizará la integración de estas tecnologías en el mercado de energía mayorista.",null,null,30,"OAP - Oficina Asesora de Planeación","Jefe(a) de Oficina de Planeación",23,1,"DCC - REC11  - Fortalecimiento de la gestión de cambio climático en la planeación sectorial y territorial  nacional.","DCC",2882303228,11,"Fortalecimiento institucional para la implementación de la política nacional para la gestión integral del recurso hídrico nacional.",3,2,"3299-900-15-3299062-Servicios de Información Actualizados",null,"Gremios",null,null,null,null,"PNPCS - Política Nacional Producción y Consumo Sostenible","Gestión Documental",null,"10.Plan Estratégico de Tecnologías de la Información y las Comunicaciones ­ PETI ",null,null,"Porcentaje de mejora en el índice de efectividad de manejo de las áreas protegidas públicas","3886 - Lineamientos de política y programa nacional de pago por servicios ambientales para la construcción de paz.","O11 - Porcentaje de estaciones que cumplen con el Oetivo intermedio III de las guías de calidad del aire de la Organización Mundial de la Salud (OMS) en material particulado inferior a 10 micras (PM10)","Porcentaje de avance en el proceso de presentación del Proyecto de Ley ante el Congreso","Reserva Forestal Nacional Protectora Cerro - Dapa-Carisucio",null,"Establecer mecanismos para garantizar participación en áreas de frontera en la zona de influencia del proyecto ","G32 - Definir e implementar conjuntamente una estrategia integral de gestión de recursos para la protección, conservación, restauración y cuidado de las áreas estratégicas de sensibilidad ambiental y ecológica de los territorios indígenas.","Amazonia  - Objetivo 3. Desarrollar modelos oductivos sostenibles asociados a la agro diversidad y al biocomercio de la Amazonia ","P10 -Servicio al ciudadano","ART79 - Ambiente sano, protección de la diversidad e integridad del ambiente, conservar las áreas de especial importancia ecológica y fomentar la educación para el logro de estos fines.",null,30,"OAP ",0,0,0,0,0,0,0,0,"Caquetá","TARAPACA",null,"CREMA11 - Gestión de recursos madereros","Incluye las acciones y actividades orientadas a minimizar la utilización de recursos madereros naturales mediante modificaciones de los procesos, así como la recuperación, la reutilización, el reciclado, el ahorro y el empleo de sustitutos de productos forestales. Las actividades de reposición, como la forestación y reforestación, están incluidas cuando se realizan en bosques naturales. También se incluye acciones y actividades referentes a la medición, el control, los laboratorios y similares, así como las actividades de educación, capacitación, información, administración y regulación. Están excluidas las actividades de explotación y exploración de recursos madereros naturales.\n\n*Reducción del consumo de recursos madereros\n*Reducción del consumo de productos forestales (madereros y no madereros) \n*Forestación y reforestación \n*Incendios forestales \n*Medición, control, laboratorios y similares relacionados con recursos madereros naturales\n",null,null,"Cerros Orientales","25000232500020050066201","POPULAR - Cerros Orientales - BOGOTA","DIRECCION DE BOSQUES, BIODIVERSIDAD Y SERVICIOS ECOSISTEMICOS "]
[10,"XVI. Pacto por la descentralización: conectar territorios, gobiernos y poblaciones",7,2,"8.2. Agua limpia y saneamiento básico adecuado: hacia una gestión responsable, sostenible y equitativa",3,3,1,"4.3.1. Avanzar en el conocimiento de escenarios de riesgos actuales y futuros para orientar la toma de decisiones en la planeación del desarrollo",3,1,2,4,"4.1.2.4. Gestión de sustancias químicas y residuos peligrosos",1,1,1,3,2,"4.1.1.3.2 Desplegar infraestructura de medición avanzada; la evaluación del potencial del desarrollo de distritos térmicos; la actualización de reglamentos y esquemas de etiquetado energético incluyendo la etiqueta vehicular y la definición de estándares de eficiencia energética para vehículos livianos nuevos y vehículos pesados nuevos y usados; y la evaluación de un esquema para tarifas horarias en tiempo real y nuevos modelos de negocio de comercialización minorista de energía eléctrica",null,null,31,"OTIC - Oficina de Tecnologías de la Información","Jefe(a) de Oficina de Tecnologías de la Información",34,1,"SEYP - REC11  - Implementación de estrategias de la política nacional de educación ambiental y participación hacia la gobernanza ambiental en Colombia.","SEYP",7710657783,12,"Generación capacidades para el adecuado desempeño ambiental del SINA en el territorio nacional.",3,3,"3299-900-15-3299063-Servicios de Información Implementados",null,"Todos",null,null,null,null,"PNIGR - Política Nacional para la Gestión Integral de Residuos","Gestión Integrada del Portafolio de Planes, Programas y Proyectos",null,"11.Plan de Tratamiento de Riesgos de Seguridad y Privacidad de la Información",null,null,"Reducir la tendencia de crecimiento de la deforestación proyectada por el IDEAM","3915 - Lineamientos de política y estrategias para el desarrollo regional sostenible del Macizo colombiano","O11 - Departamentos con planes integrales (adaptación y mitigación) frente al cambio climático","Porcentaje de avance en el proceso de expedición del decreto","Arroyo Bruno",null,"Estimular esquemas silvopastoriles","G33 - Diseñar, formular e implementar de manera concertada con las organizaciones de los pueblos indígenas un programa de restauración, conservación de ecosistemas y medidas de adaptación y mitigación al cambio climático para los territorios indígenas de acuerdo a la cosmovisión de cada pueblo. ","Eje Cafetero y Antioquia  - Objetivo 2. Incentivar actividades económicas sostenibles y omover la recuperación ambiental de áreas degradadas por la extracción ilícita de minerales","P11 -Racionalización de trámites","ART80 - Manejo y aprovechamiento recursos naturales. Prevención y control de factores de deterioro ambiental (sanciones legales y exigir la reparación de daños).  \nCooperación con otras naciones en la protección de los ecosistemas fronterizos.",null,31,"OTIC ",0,0,0,0,0,0,0,0,"Casanare","ABEJORRAL",null,"CREMA12 - Gestión de recursos acuáticos","Incluye las acciones y actividades orientadas a minimizar la extracción de peces silvestres y otros recursos acuáticos mediante modificaciones de los procesos, el empleo de recursos alternativos y cualquier otro tipo de medida. Incluye las actividades de reposición como la repoblación de peces silvestres cuando tiene por objeto mantener o acrecentar la densidad del stock (no su diversidad biológica - CAPA6). También se incluye acciones y actividades relacionadas con la medición, el control, los laboratorios y similares, así como las de educación, capacitación, información, administración y regulación. Esta clase comprende todas las acciones y actividades que tienen por objeto la gestión, el mantenimiento y el incremento del stock de recursos  acuáticos. No se incluye la protección de la biodiversidad de los recursos acuáticos.\n\n*Reducción de la extracción de recursos acuáticos \n*Reposición de stocks de recursos acuáticos \n*Medición, control, laboratorios y similares relacionados con los recursos acuáticos ",null,null,"Certificado de la función ecológica","27001312100120150005300","RESTITUCIÓN DE TIERRAS - Certificado de la función ecológica - CHOCO","ANT -SINA"]
[13,"XXV. Pacto Región Océanos: Colombia, potencia bioceánica.",8,1,"12.1. Diagnóstico, objetivos y estrategias para la equidad de oportunidades de grupos étnicos",3,3,2,"4.3.2. Asegurar la corresponsabilidad territorial y\nsectorial en la reducción del riesgo de desastres y la\nadaptación a la variabilidad y al cambio climático",3,1,3,1,"4.1.3.1. Fomento a la economía circular en procesos productivos",1,1,1,3,3,"4.1.1.3.3 Fortalecimiento de la Comisión para el Uso Racional y Eficiente de la Energía y Fuentes No Convencionales y la inclusión de metas obligatorias de eficiencia energética en el Programa de Uso Racional y Eficiente de Energía.",null,null,32,"OAJ - Oficina Asesora Jurídica","Jefe(a) de Oficina Juridica",34,2,"SEYP - REC15  - Implementación de estrategias de la política nacional de educación ambiental y participación hacia la gobernanza ambiental en Colombia.","SEYP",5500000000,13,"Implementación de estrategias de la política nacional de educación ambiental y participación hacia la gobernanza ambiental en Colombia.",4,1,"3201-900-4-3201001-Documentos de política para el fortalecimiento del desempeño ambiental de los sectores productivos",null,null,null,null,null,null,"PNCC – Política Nacional de Cambio Climático","Gestión Jurídica",null,"12.Plan de Seguridad y Privacidad de la Información",null,null,"Acuerdos de cero deforestación para las cadenas productivas del sector agropecuario en implementación (T)","3919 - Política Nacional de Edificaciones Sostenibles","O11 - Porcentaje de departamentos y ciudades capitales que incorporan criterios de cambio climático en las líneas instrumentales de sus planes de desarrollo","Porcentaje de avance en el proceso de expedición de la resolución",null,null,"Evaluar efectos ambientales y sociales del gasto público y de los subsidios (plan de acceso)\n","G34 - En el marco del programa nacional de Pago por Servicios Ambientales el Ministerio de Ambiente y Desarrollo Sostenible, con el apoyo de las entidades del Sistema Nacional y Ambiental, apoyarán el diseño concertado del programa de Pago por Servicios Ambientales para la preservación, restauración y conservación de páramos, bosques, selvas y zonas estratégicas de los territorios indígenas, desde las  cosmovisiones de los pueblos indígenas, y promoviendo  su implementación.","Llanos-Orinoquia  - Objetivo 2. Impulsar la oductividad y mejorar la eficiencia de los clústeres y las cadenas de valor agropecuarias, agroindustriales y turísticas","P12 -Participación ciudadana en la gestión pública","ART82 - Protección del espacio público y su destinación al uso común.  Regulación del uso del suelo en defensa del interés común.",null,32,"OAJ ",0,0,0,0,0,0,0,0,"Cauca","ABRIAQUI",null,"CREMA13 - Gestión de otros recursos biológicos","Incluye las acciones y actividades orientadas a minimizar la extracción de recursos biológicos, distintos de los madereros y los acuáticos, mediante modificaciones de los procesos, el empleo de otros recursos y cualquier otro tipo de medida. Incluye las actividades de reposición como la repoblación de la fauna y la flora silvestres cuando tienen por objeto el mantenimiento o el aumento de la densidad de sus stocks (no de la diversidad biológica - CAA 6). También incluye las acciones y actividades relacionadas con la medición, el control, los laboratorios y similares, así como las actividades de educación, capacitación, información, administración y regulación. \n\n*Reducción de la extracción de recursos biológicos \n*Reposición del stock de recursos biológicos\n*Medición, control, laboratorios y similares relacionados con los stocks de recursos biológicos\n\nNota: excepto los recursos madereros y acuáticos.  ",null,null,"Comunidad indígena Alto Unuma pueblo Sikuani","50001233300020160050701","ACCIÓN DE TUTELA  - Consulta previa-comunidad indígena Alto Unuma pueblo Sikuani - VILLAVICENCIO","SUBDIRECCIÓN DE EDUCACIÓN Y PARTICIPACIÓN "]
[null,null,9,1,"13.1. Alianza por la inclusión y la dignidad de todas las personas con discapacidad",3,3,3,"4.3.3. Movilizar el financiamiento para la gestión del riesgo y la adaptación e incentivar la protección financiera ante desastres",3,1,3,2,"4.1.3.2. Aumento del aprovechamiento, reciclaje y tratamiento de residuos",1,1,1,4,1,"4.1.1.4.1 Actualizar las guías ambientales para fortalecer la gestión, manejo y desempeño ambiental de la industria.",null,null,33,"SG - Secretaría General","Secretario(a) General",31,1,"OTIC - REC11  - Consolidación sistema de información ambiental SIAC como eje central de información ambiental oficial y soporte para la toma de decisiones a nivel regional y nacional y conocimiento en materia ambiental a nivel nacional y regional Bogotá.","OTIC",5100000000,14,"Implementación de la estrategia de divulgación y comunicación de la información ambiental a nivel nacional.",4,2,"3201-900-4-3201002-Documentos de lineamientos técnicos para el fortalecimiento del desempeño ambiental de los sectores productivos",null,null,null,null,null,null,"PNGIRAEE - Política Nacional Gestión Integral de Residuos de Aparatos Eléctricos y Electrónicos","Instrumentación Ambiental",null,null,null,null,"Plataformas colaborativas conformadas para la articulación de las inversiones y acciones públicas y privadas alrededor de las cuencas hidrográficas","3931 - Política Nacional para la Reincorporación Social y Económica de Exintegrantes de las FARC-EP","O12 - Residuos peligrosos aprovechados y tratados","Porcentaje de avance en el proceso de expedición del decreto e implementación de las nuevas reglas de cálculo y asignación de la tasa de aprovechamiento forestal",null,null,"Evaluar impacto de políticas ambientales y producir indicadores fiables para medir desempeño ambiental","G38 - En el marco de la CNAI se construirá la política ambiental indígena tomando en consideración y enmarcada en las diferentes políticas ambientales, la cual será protocolizada en el marco de la MPC","Llanos-Orinoquia  - Objetivo 3. Consolidar la estructura ecológica incipal y gestionar integralmente el recurso hídrico para el desarrollo oductivo sostenible de la región","P13 -Seguimiento y Evaluación del Desempeño Institucional",null,null,33,"SG ",0,0,0,0,0,0,0,0,"Cesar","ALEJANDRIA",null,"CREMA14 - Gestión de recursos hídricos","Incluye las acciones y actividades orientadas a minimizar la extracción de recursos hídricos mediante modificaciones en los procesos, así como la reutilización, el reciclado, el ahorro y el uso de sustitutos de los recursos de agua dulce. Incluye las actividades destinadas a la reposición del stock de agua. También incluye acciones y actividades referentes a la medición, el control, los laboratorios y similares, así como las actividades de educación, capacitación, información, administración y regulación. No incluye las actividades de explotación, exploración y distribución.\n\n*Reducción de la extracción de recursos hídricos \n*Reducción de pérdidas y filtraciones de agua, reutilización y ahorro de agua \n*Reposición de recursos hídricos\n*Medición, control, laboratorios y similares relacionados con los recursos hídricos ",null,null,"Comunidades zona de influencia del Río Cauca - Hidroituango","050013103004201900071-01\nT-038-2019","ACCION DE TUTELA - Derecho a la salud - al medio ambiente sano - a la vida digna  de las comunidades ubicadas en la zona de influencia del Río Cauca con ocasión del proyecto Hidroituago - MEDELLIN","HIDRICO"]
[null,null,10,1,"16.1. Desarrollo urbano y Sistema de Ciudades (SC) para la sostenibilidad, la productividad y la calidad de vida",3,4,1,"4.4.1. Fortalecer la institucionalidad y la regulación para la sostenibilidad y la financiación del sector ambiental",3,1,4,1,"4.1.4.1. Instrumentos financieros para incentivar el sector productivo en su transición a la sostenibilidad",1,1,1,4,2,"4.1.1.4.2 Implementar una estrategia para el desarrollo de proyectos de reconversión e innovación tecnológica en la industria con viabilidad ambiental, técnica y financiera. ",null,null,34,"SEP - Subdirección de Educación y Participación","Subdirector(a) de Educación y Participación",31,2,"OTIC - REC15  - Consolidación sistema de información ambiental SIAC como eje central de información ambiental oficial y soporte para la toma de decisiones a nivel regional y nacional y conocimiento en materia ambiental a nivel nacional y regional Bogotá.","OTIC",4230000000,15,"Implementación de las estrategias, instrumentos y recomendaciones de la OCDE en materia de gestión ambiental a nivel nacional.",4,3,"3201-900-4-3201006-Documentos normativos para el fortalecimiento del desempeño ambiental de los sectores productivos",null,null,null,null,null,null,null,"Negociación Internacional, Recursos de Cooperación y Banca",null,null,null,null,"Autoridades ambientales que adoptan la Metodología de Evaluación de Daños y Análisis de Necesidades Ambientales","3934 - Política de Crecimiento Verde","O12 - Porcentaje de equipos y desechos de policlorobifenilos (PCB) eliminados","Porcentaje de avance en el proceso de activación y funcionamiento del Comité",null,null,"Evaluar incentivos fiscales con motivaciones ambientales y reformar los que no son ambiental o económicamente eficaces y eficientes","G39 - Incluir un análisis acordado a partir de la metodología avalada en la Corte Constitucional para dar cumplimiento a la Sentencia T-445 de 2016, en la investigación científica y sociológica de los impactos sobre los ecosistemas de la actividad minera y la explotación lícita de los minerales en los territorios indígenas. ","Océanos  - Objetivo 1. Fortalecer la gobernanza y la institucionalidad para la administración integral de los océanos, armonizando los instrumentos de planificación y ordenamiento territorial y marino","P14 -Gestión Documental",null,null,34,"SEP ",0,0,0,0,10220000000,400000000,100000000,0,"Chocó","AMAGA",null,"CREMA15 - Actividades de investigación y desarrollo para la gestión de recursos ","Trabajos creativos realizados en forma sistemática con el fin de incrementar los conocimientos y su utilización, para concebir nuevas aplicaciones en ámbito de la gestión de los recursos naturales y su ahorro.\nNo incluye actividades de I&D relacionadas con la protección del ambiente.",null,null,"Conectividad entre Cerros Orientales y Rio Bogotá","11001333400420190006500","ACCION DE NULIDAD - Lagos de Torca definir la conectividad entre Cerros Orientales y Rio Bogotá - BOGOTA","BOSQUES, ORDENAMIENTO, HIDRICO"]
[null,null,10,2,"16.2. Gobiernos territoriales capaces y efectivos: fortalecimiento institucional y modernización para la descentralización efectiva y responsable",3,4,2,"4.4.2. Robustecer los mecanismos de articulación y coordinación para la sostenibilidad",3,1,4,2,"4.1.4.2. Financiación para la mitigación del cambio climático",1,1,1,4,3,"4.1.1.4.3 Implementar una estrategia interinstitucional para la gestión energética del sector industrial y se gestionarán recursos y se implementarán las acciones para fomentar el consumo energético eficiente y la optimización de las operaciones logísticas y de transporte de carga en la industria.",null,null,35,"VPNA - Viceministerio de Politicas y Normalización Ambiental","Viceministro(a) de Politicas y Normalización Ambiental",31,3,"OTIC - REC11  - Fortalecimiento de la estrategia de TI y transformación digital en el Ministerio de Ambiente y Desarrollo Sostenible nacional.","OTIC",5000000000,16,"Conservación de cuencas hidrográficas abastecedoras de acueductos municipales a nivel Nacional.",4,4,"3201-900-4-3201010-Servicio de divulgación de la incorporación de consideraciones ambientales en la planificación sectorial",null,null,null,null,null,null,null,"Gestión Estratégica de Tecnologías de la Información",null,null,null,null,"Porcentaje de departamentos que implementan iniciativas de adaptación al cambio climático orientadas por las autoridades ambientales","3943 - Política para el mejoramiento de la calidad del aire","O12 - Residuos de bombillas con mercurio aprovechadas o gestionadas","Porcentaje de avance en el proceso de implementación Servicio Forestal Nacional ",null,null,"Evaluar resultados del Programa nacional de investigación, evaluación, prevención, reducción y control de fuentes de contaminación terrestres y marinas","G40 - Concertar en el marco de la MPC el diseño y/o adecuación y la implementación del programa de fortalecimiento a los pueblos indígenas en capacidades técnicas, administrativas y financieras, contempladas en el despliegue del Modelo Integrado de Planeación y Gestión –MIPG-, con enfoque diferencial y de mujer, familia y generación, liderados por la función pública, coordinado por la Escuela Superior de Administración Pública –ESAP-. Por su parte, el Ministerio de Medio Ambiente liderará todo lo relacionado con capacidades para el ordenamiento ambiental, biodiversidad y gobernanza territorial ambiental indígena.","Océanos  - Objetivo 2. Incrementar el conocim ient o, invest igación, innovación y aopiación social para el desarrollo integral de espacios oceánicos, costeros e insulares ","P15 -Transparencia y acceso a la información pública y lucha contra la corrupción",null,null,35,"VPNA ",0,0,0,0,0,0,0,0,"Córdoba","AMALFI",null,"CREMA16 - Otras actividades de gestión de recursos","*Administración general de recursos naturales \n*Educación, capacitación e información \n*Actividades con gastos indivisibles \n*Actividades no clasificadas en otra parte ",null,null,"Construcción de vía que afecta Zona de Reserva Forestal","11001333102920080032002","ACCION POPULAR  - Construcción de vía que afecta Zona de Reserva Forestal - BOGOTA","DIRECCIÓN DE BOSQUES BIODIVERSIDAD Y SERVICIOS ECOSISTEMICOS"]
[null,null,11,1,"1.1. Colombia en la escena global: política exterior responsable, innovadora y constructiva",3,4,3,"4.4.3. Implementar una estrategia para la gestión y seguimiento de los conflictos socioambientales generados por el acceso y uso de los recursos naturales, con base en procesos educativos y participativos que contribuyan a la consolidación de una cultura ambiental",3,1,4,3,"4.1.4.3. Tasas ambientales",1,1,1,4,4,"4.1.1.4.4 Desarrollar portafolios con las mejores técnicas disponibles y prácticas ambientales en sectores priorizados, de acuerdo con la problemática de calidad del aire.",null,null,36,"VOAT - Viceministerio de Ordenamiento Ambiental del Territorio","Viceministro(a) de Ordenamiento Ambiental del Territorio",26,1,"GCOM - REC11  - Implementación de la estrategia de divulgación y comunicación de la información ambiental a nivel nacional.","GCOM",706693991,17,"Formulación administración de  los recursos FONAM para el uso sostenible y protección de las especies CITES nacional.",4,5,"3201-900-4-3201012-Documentos de política para mejorar la calidad ambiental de las áreas urbanas",null,null,null,null,null,null,null,"Gestión Administrativa ,Comisiones  y Apoyo Logístico",null,null,null,null,"Porcentaje de implementación del Sistema Nacional de Información de Cambio Climático","3990 -Colombia Potencia Bioceánica Sostenible 2030","O12 - Negocios verdes verificados","Porcentaje de avance en el proceso de implementación del plan de acción para fortalecimiento ",null,null,"Expedir resolución sobre empaques y envases en el marco del programa REP","G41 - Intégrese en el siguiente artículo a la Ley del Plan Nacional de Desarrollo.\n\nModifíquese el inciso segundo del artículo 3 del Decreto 870 de 2017 el cual quedará de la siguiente manera:\n\nEl Gobierno Nacional y las organizaciones indígenas que asisten a la MPC construirán de manera conjunta la propuesta de reglamentación de pago por servicios ambientales-PSA y otros incentivos de conservación para los pueblos y comunidades indígenas y radicarán esta propuesta a la MPC una vez entre en vigencia la ley del Plan Nacional de Desarrollo, para incluir su respectivo proceso de consulta previa con los pueblos y organizaciones indígenas. \n\nPARÁGRAFO PRIMERO: El presente artículo, se interpretará sin detrimento del derecho a la consulta previa sobre el PSA e incentivos a la conservación para los demás grupos étnicos del país.\n\nPARÁGRAFO SEGUNDO. Aplicación del incentivo de Pago por Servicios Ambientales (PSA) en territorios de Pueblos Indígenas. Para el diseño e implementación de PSA en territorios indígenas de que trata el artículo 3 de Decreto Ley 870 de 2017, se aplicará con carácter transitorio lo dispuesto por el Decreto 1007 de 2018 y las normas que les modifiquen o complementen, y adicionalmente se tendrá en cuenta las siguientes consideraciones:\n1. Los Proyectos de PSA en territorios indígenas serán de carácter voluntario entre las partes, reconocerán las prácticas tradicionales de producción, estarán en armonía con los instrumentos de planificación propios y garantizarán la adecuada participación autonomía y libre autodeterminación de las comunidades indígenas.\n2. Los pueblos indígenas serán beneficiarios del incentivo de manera colectiva de acuerdo a los procedimientos que de manera autónoma se establezcan en sus territorios.\n3. La concertación en el marco del PND 2018-2022 sobre el incentivo de PSA servirá de marco para el diseño e implementación de proyectos específicos de PSA en territorios indígenas\nFormular y desarrollar concertadamente en la CNTI, los lineamientos diferenciales del programa de monitoreo comunitario ambiental, a partir de los conocimientos propios, la ley de origen y gobierno propio de cada pueblo para fortalecer los conocimientos y el manejo ambiental de los territorios indígenas. ","Océanos  - Objetivo 3. Optimizar la conectividad, la infraestructura y la logística entre mar y tierra e impulsar el desarrollo oductivo y el crecimiento de las actividades marítimas ","P16- Gestión de la información estadística",null,null,36,"VOAT ",0,0,0,0,0,0,0,0,"Cundinamarca","ANDES",null,null,null,null,null,"Construcción obras publicas atención desastres","66001220500020160010600","ACCION DE TUTELA  - Construcción obras publicas atención desastres  - PEREIRA ","OFICINA ASESORA DE PLANEACION "]
[null,null,12,1,"7.1. Hacia una sociedad digital e industria 4.0: por una relación más eficiente, efectiva y transparente entre mercados, ciudadanos y Estado.",3,4,4,"4.4.4. Mejorar la gestión de la información y su interoperabilidad entre los diferentes sectores",3,2,1,1,"4.2.1.1. Ejercer control territorial",1,1,1,5,1,"4.1.1.5.1 Avanzar en el desarrollo de las recomendaciones establecidas en el documento CONPES 3919 de 2018 de edificaciones sostenibles, para lo cual tendrá en cuenta el análisis de impacto normativo de la definición de los precios de la VIS y la VIP.",null,null,null,null,null,29,1,"ONVS - REC11  - Fortalecimiento de la oferta institucional para la sostenibilidad ambiental del territorio en el marco de los negocios verdes y sostenibles.","ONVS",1754683995,null,null,4,6,"3201-900-4-3201013-Documentos de lineamientos técnicos para mejorar la calidad ambiental de las áreas urbanas",null,null,null,null,null,null,null,"Gestión de Servicios de Información y Soporte Tecnológico",null,null,null,null,"Índice de Evaluación del Desempeño Institucional de las Corporaciones Autónomas Regionales",null,"O13 - Reducción de emisiones totales de gases efecto invernadero","Porcentaje de avance en el proceso de integración de los sistemas de información ",null,null,"Formular Plan de Acción para la Política Nacional para la Gestión Integral de la Biodiversidad y Sus Servicios Ecosistémicos ","G42 - Formular y desarrollar concertadamente en la CNTI, los lineamientos diferenciales del programa de monitoreo comunitario ambiental, a partir de los conocimientos propios, la ley de origen y gobierno propio de cada pueblo para fortalecer los conocimientos y el manejo ambiental de los territorios indígenas. ",null,"P17 -Gestión del conocimiento y la innovación",null,null,null,null,null,null,null,null,null,null,null,null,"Guainía","ANGELOPOLIS",null,null,null,null,null,"Consulta previa","EXPEDIENTES NO.: T-4.126.294 Y T-4.298.584 T-733 DE 2017","TUTELA - Consulta previa T-733/2017 - ","DIRECCION DE ASUNTOS AMBIENTALES, SECTORIAL Y URBANO - DAASU"]
[null,null,13,1,"25.1. Fortalecer la gobernanza y la institucionalidad para la administración integral de los océanos, armonizando los instrumentos de planificación y ordenamiento territorial y marino",4,1,1,"9.1.1. Promover el desarrollo y la competitividad de la industria minero-energética",3,2,1,2,"4.2.1.2. Gestión transectorial",1,1,1,5,2,"4.1.1.5.2 Desarrollar  una herramienta para cuantificar pérdidas en los sistemas de acueducto y priorizar la renovación de infraestructura y redes; así como formular lineamientos para sistemas urbanos de drenaje sostenible y realizar su implementación en un proyecto realizado en una región con escasez hídrica.",null,null,null,null,null,29,2,"ONVS - REC15  - Fortalecimiento de la oferta institucional para la sostenibilidad ambiental del territorio en el marco de los negocios verdes y sostenibles.","ONVS",4812321705,null,null,5,1,"3206-900-3-3206002-Documentos de lineamientos técnicos para la gestión del cambio climático y un desarrollo bajo en carbono y resiliente al clima",null,null,null,null,null,null,null,"Todos",null,null,null,null,"Acuerdos y agendas interministeriales y productivos implementados",null,"O13 - Departamentos con planes integrales (adaptación y mitigación) frente al cambio climático","Porcentaje de avance en desarrollo del Inventario Forestal Nacional",null,null,"Formular política de RAEEs","G52 - Crear de manera conjunta con las organizaciones indígenas una estrategia nacional de corto, mediano y largo plazo para la prevención y el control de la deforestación en territorios indígenas; los proyectos que resulten de dicha estrategia, una vez formulados, serán inscritos en el banco de programas y proyectos de inversión nacional. Estos proyectos podrán ser utilizados para acceder a las diferentes fuentes de financiación de orden nacional y de cooperación internacional, entre ellos el Fondo Colombia Sostenible, Banco Mundial, Fondo Noruego, entre otros.",null,"P18 -Control Interno",null,null,null,null,null,null,null,null,null,null,null,null,"Guaviare","ANGOSTURA",null,null,null,null,null,"Consulta previa","11001220300020090011000 T-769 DE 2009","TUTELA - Consulta previa T-769/2009 - BOGOTÁ","DIRECCIÓN DE ASUNTOS AMBIENTALES SECTORIAL Y URBANA"]
[null,null,13,2,"25.2. Incrementar el conocimiento, investigación, innovación y apropiación social para el desarrollo integral de espacios oceánicos, costeros e insulares",4,2,1,"9.2.1. Objetivo 1. Promover las nuevas tendencias energéticas",3,2,1,3,"4.2.1.3. Conservación de ecosistemas",1,1,1,5,3,"4.1.1.5.3 Formulación e implementación de una estrategia nacional de ciudades y cambio climático que incluya portafolios de proyectos de mitigación y adaptación bancables alineados con las metas nacionales.",null,null,null,null,null,27,1,"OAI - REC11  - Fortalecimiento en el control y seguimiento a los compromisos adquiridos en escenarios internacionales de la gestión ambiental.","OAI",846273735,null,null,5,2,"3206-900-3-3206007-Servicio de articulación para la gestión del cambio climático en la toma de decisiones sectoriales y territoriales",null,null,null,null,null,null,null,null,null,null,null,null,"Porcentaje de las solicitudes de licencias ambientales competencia de la ANLA resueltas dentro de los tiempos establecidos en la normatividad vigente",null,"O13 - Porcentaje de departamentos y ciudades capitales que incorporan criterios de cambio climático en las líneas instrumentales de sus planes de desarrollo","Número de campañas realizadas",null,null,"Fortalecer esfuerzos para reducir el impacto en la salud de la contaminación del aire en urbes","G59 - Diseñar de manera concertada y expedir el instrumento normativo que crea la Comisión Nacional Ambiental Indígena-CNAI y garantizar el funcionamiento.",null,null,null,null,null,null,null,null,null,null,null,null,null,null,"Huila","ANORI",null,null,null,null,null,"Creación zonas veredales transitorias - proceso de paz","2000111020002016-00422-01","ACCION DE TUTELA - Consulta previa-creación zonas veredales transitorias - proceso de paz - VALLEDUPAR","BOSQUES \nEDUCACIÓN Y PARTCIPACIÓN "]
[null,null,13,3,"25.3. Optimizar la conectividad, la infraestructura y la logística entre mar y tierra e impulsar el desarrollo productivo y el crecimiento de las actividades marítimas",4,2,2,"9.2.2. Objetivo 2. Consolidar la cadena energética",3,2,2,1,"4.2.2.1. Consolidar el Sinap",1,1,1,6,1,"4.1.1.6.1 Avanzar de manera medible y consistente, con la trayectoria de reducción de emisiones de GEI propuesta por Colombia, en el cumplimiento de la meta de mitigación del 20% de cada sector al año 2030, en consonancia con los Planes Integrales de Gestión de Cambio Climático Sectoriales (PIGCCS).",null,null,null,null,null,27,2,"OAI - REC15  - Fortalecimiento en el control y seguimiento a los compromisos adquiridos en escenarios internacionales de la gestión ambiental.","OAI",1200000000,null,null,5,3,"3206-900-3-3206011-Servicios de información para el seguimiento a los compromisos en cambio climático de Colombia",null,null,null,null,null,null,null,null,null,null,null,null,"Regiones beneficiadas por talleres de economía circular: El Ministerio de Ambiente y Desarrollo Sostenible en función de la estrategia de económica circular acuerda vincular al pueblo Rrom para participar en los talleres priorizados que se dictaran en las diferentes regiones del país, en donde se diseñaran acciones para impulsar la estrategia con cada uno de los sectores productivos, la academia y el sector público.",null,"O13 - Planes sectoriales integrales de cambio climático formulados","Porcentaje de avance en el proceso de implementación del sistema de trazabilidad ",null,null,"Fortalecer financiamiento de áreas protegidas","H40 - Ministerio de Ambiente y Desarrollo Sostenible concertara y construirá conjuntamente con organizaciones y autoridades indígenas, los proyectos que permitan la creación de centros botánicos para la investigación, conservación y recuperación de plantas endémicas y medicinales que permitan garantizar la conservación y revitalización de las practicas medicinales, sitios sagrados y sistemas propios de producción acorde a la Ley de Origen, Derecho Mayor y Derecho Propio. ",null,null,null,null,null,null,null,null,null,null,null,null,null,null,"La Guajira","ANZA",null,null,null,null,null,"Cuenca Hidrográfica de los Ríos Timbiquí, Coteje y Sese",201400104,"ORDINARIO-RESTITUCION DE TIERRAS - Conservación restauración y manejo sostenible del ecosistema forestal de la Cuenca Hidrográfica de los Ríos Timbiquí, Coteje y Sese para mitigar las afectaciones ambientales - POPAYAN","DAASU"]
[null,null,null,null,null,5,1,1,"5.1.1. Modernización y coordinación institucional ",3,2,2,2,"4.2.2.2. Intervenciones integrales en áreas ambientales estratégicas",1,1,2,1,1,"4.1.2.1.1 Actualizar los estándares de calidad del aire y de emisión de fuentes móviles hasta llegar al EURO VI y reglamentar  el contenido de azufre en los combustibles para reducir la contaminación atmosférica en Colombia",null,null,null,null,null,30,1,"OAP - REC11  - Fortalecimiento de los procesos de planeación, evaluación y seguimiento a la gestión adelantada por el sector ambiental.","OAP",2007214059,null,null,6,1,"3299-900-14-3299011-Sedes adecuadas",null,null,null,null,null,null,null,null,null,null,null,null,"Porcentaje de negocios verdes asistidos técnicamente: El Ministerio de Ambiente brindará asistencia técnica para transferir las metodologías y lineamientos de las iniciativas productivas con la comunidad Rrom, que cumplan con los criterios de negocios verdes, a través de las ventanillas de negocios verdes en las Autoridades Ambientales.",null,"O14 - Miles de hectáreas de áreas marinas protegidas","Número de autoridades ambientales que reciben acompañamiento técnico",null,null,"Fortalecer mecanismos de acceso a recursos genéticos","C2 - En el marco de la estrategia  nacional de restauración, dentro del componente indígena se incluirán concertadamente con las autoridades indígenas, medidas  conforme a las dinámicas regionales,   para la producción de plántulas de valor ecológico, cultural, medicinal y alimenticio que pueden provenir de viveros o regeneración natural.",null,null,null,null,null,null,null,null,null,null,null,null,null,null,"Magdalena","APARTADO",null,null,null,null,null,"Cuerpos de agua y sanitarias en Armenia y protección de aguas y ríos y quebradas de Armenia","63001233300020180006900","ACCIÓN POPULAR - Formular y financiar como lo señala el psmv para los cuerpos de agua y sanitarias en Armenia y protección de aguas y ríos y quebradas de Armenia - ARMENIA","DIRECCION DE RECURSO HIDRICO"]
[null,null,null,null,null,6,1,1,"6.1.1. Política portuaria y marítima: accesos marítimos y nodos portuarios seguros y adaptados a los retos del comercio exterior",3,2,3,1,"4.2.3.1. Desarrollo de incentivos a la conservación",1,1,2,1,2,"4.1.2.1.2 Implementar un programa para mejorar la operación, los métodos de medición, la cobertura y el control de los Centros de Diagnóstico Automotor y reducir la evasión de la revisión técnico-mecánica y de gases. ",null,null,null,null,null,33,1,"SG - REC11  - Fortalecimiento de la gestión institucional de la secretaría general del Ministerio de Ambiente y Desarrollo Sostenible.","SG",5268917674,null,null,6,2,"3299-900-14-3299052-Servicio de Gestión Documental",null,null,null,null,null,null,null,null,null,null,null,null,"Lineamientos diseñados: Diseñar un documento que incluya los lineamientos para el trabajo con el Pueblo Rrom en la educación ambiental, en articulación con las Autoridades Ambientales Urbanas y las Corporaciones Autónomas Regionales competentes. Este trabajo se lidera de manera conjunta con las Kumpañy y Organizaciones Rrom.",null,"O14 - Porcentaje de estaciones de monitoreo de aguas marinas con categoría entre aceptable a óptima del Índice de calidad de Aguas Marinas (ICAM)","Porcentaje de avance en la formulación de la  estrategia integral de financiación",null,null,"Fortalecer monitoreo ambiental nacional y regional considerando riesgos en salud humana y ambiente","B1 - El Ministerio de Ambiente y Desarrollo Sostenible concertará con las autoridades  indígenas el diseño, formulación e implementación  de estrategias de conservación y restauración  en el Pacifico,  para el desarrollo de un portafolio de planes, programas y proyectos de conservación ambiental, articulado con los planes de vida.  ",null,null,null,null,null,null,null,null,null,null,null,null,null,null,"Meta","ARBOLETES",null,null,null,null,null,"Cumplimiento ordenes quinta y sexta de la sentencia",201400106,"ORDINARIO-RESTITUCION DE TIERRAS - Cumplimiento ordenes quinta y sexta de la sentencia - UNGIA-CHOCO","DAASU  Y BOSQUES"]
[null,null,null,null,null,7,1,1,"8.1.1. Modernización de los mercados actuales y promoción de la innovación",3,2,3,2,"4.2.3.2. Fortalecimiento del Programa Nacional de PSA",1,1,2,1,3,"4.1.2.1.3 Establecer un programa nacional de sustitución de estufas de leña por estufas eficientes",null,null,null,null,null,null,null,"OCI - REC11  - Fortalecimiento de los procesos de planeación, evaluación y seguimiento a la gestión adelantada por el sector ambiental.","OCI",0,null,null,6,3,"3299-900-14-3299054-Documentos de Planeación   ",null,null,null,null,null,null,null,null,null,null,null,null,"Visitantes a las áreas protegidas priorizadas en el Plan Maestro de Ecoturismo elaborado con Presidencia de la República (PNN Chingaza, PNN Tayrona, PNN Gorgona, PNN Los Nevados, PNN Utría, VP Isla de Salamanca y SFF Iguaque) administradas por Parques Nacionales Naturales con vocación ecoturística.",null,"O15 - Miles de hectáreas de áreas protegidas","Porcentaje de avance en el proceso de formulación y expedición de la modificación del Decreto ",null,null,"Garantizar integración de la biodiversidad en EAE","B5 - El Ministerio de Ambiente y Desarrollo Sostenible concertara con las autoridades  indígenas el diseño, formulación e implementación  de estrategias de conservación y restauración  en la Orinoquia,  para el desarrollo de un portafolio de planes, programas y proyectos de conservación ambiental, articulado con los planes de vida.  ",null,null,null,null,null,null,null,null,null,null,null,null,null,null,"Norte de Santander","ARGELIA",null,null,null,null,null,"Deforestación de la Amazonia.","11001220300020180031901\nSTC 4360 - 2018","TUTELA  - Incremento deforestación de la Amazonia. - BOGOTÁ","DIRECCIÓN DE BOSQUES, BIODIVERSDAD Y SERVICIOS ECOSISTÉMICOS; DIRECCIÓN DE ASUNTOS AMBIENTALES SECTORIAL Y URBANA,  DIRECCIÓN DE CAMBIO CLIMÁTICO Y GESTIÓN DEL RIESGO, DIRECCIÓN DE ORDENAMIENTO AMBIENTAL TERRITORIAL Y SISTEMA NACIONAL AMBIENTAL-SINA;  SUBDIRECCIÓN DE EDUCACIÓN Y PARTICIPACIÓN, OFICINA DE TECNOLOGÍAS DE LA INFORMACIÓN Y LA COMUNICACIÓN "]
[null,null,null,null,null,7,2,1,"8.2.1. Implementar estrategias para el logro de una prestación eficiente, sostenible e incluyente de los servicios de APSB con orientación regional, y una política nacional de\ngestión integral de residuos sólidos que articule el concepto de economía circular",3,2,4,1,"4.2.4.1. Impulso de la bioeconomía",1,1,2,1,4,"4.1.2.1.4 Poner en marcha un programa para mejorar la cobertura y disponibilidad de información de emisiones y calidad del aire,  así como realiar acciones estratégicas focalizadas en cinco ciudades críticas lo que contemplará un programa de capacitación para mejorar la formulación e implementación de planes de prevención, reducción y control de la contaminación del aire, así como mecanismos para la participación ciudadana y la denuncia de fuentes contaminantes.",null,null,null,null,null,28,1,"OCI - REC11  - Fortalecimiento de la gestión institucional de la secretaría general del Ministerio de Ambiente y Desarrollo Sostenible.","OCI",200000000,null,null,6,4,"3299-900-14-3299057-Documentos de lineamientos técnicos",null,null,null,null,null,null,null,null,null,null,null,null,"Área en proceso de restauración en la Cuenca del Río Atrato* - Pacto Región Pacífico",null,"O15 - Pérdida anualizada de bosque natural","Porcentaje de avance en el desarrollo de los mecanismos de precios asociados a las emisiones de CO2",null,null,"Hacer inventario de sitios contaminados","B6 - El Ministerio de Ambiente y Desarrollo Sostenible  concertara con las autoridades  indígenas Amazónicas, el diseño, formulación e implementación  de estrategias de conservación, restauración, mitigación y adaptación ambiental  en la Amazonia,  para el desarrollo de un portafolio de  proyectos de conservación ambiental, articulado con los planes de vida.  ",null,null,null,null,null,null,null,null,null,null,null,null,null,null,"Nariño","ARMENIA",null,null,null,null,null,"Delimitación del páramo jurisdicciones Santurbán","68001233300020150073400","TUTELA - Delimitación del páramo jurisdicciones Santurbán Berlín en el marco de un proceso de participación ambiental - BUCARAMANGA ","DBBSE; RECURSO HIDRICO; SEP; COMUNICACIONES; NEGOCIOS VERDES"]
[null,null,null,null,null,7,2,2,"8.2.2. Adelantar acciones que garanticen la gobernanza comunitaria y la sostenibilidad de las soluciones adecuadas de agua potable, manejo de aguas residuales y residuos sólidos\npara incrementar la cobertura, continuidad y la calidad del servicio en zonas rurales y PDET",3,2,4,2,"4.2.4.2. Fomento y fortalecimiento de negocios verdes y sostenibles",1,1,2,2,1,"4.1.2.2.1 Promover la implementación del Plan Hídrico Nacional de manera coordinada y con énfasis en los programas de regulación hídrica, de aguas subterráneas, de legalización de usuarios, de investigación y de monitoreo del recurso hídrico (aguas superficiales, subterráneas y marinas).",null,"FORTALECIMIENTO FORTALECER  LA GESTIÓN AMBIENTAL DEL ESTADO COLOMBIANO SOBRE LAS ZONAS MARINAS Y COSTERAS Y RECURSOS ACUÁTICOS NACIONAL - REC 11",null,null,null,null,null,"OAJ - REC11  - Fortalecimiento de los procesos de planeación, evaluación y seguimiento a la gestión adelantada por el sector ambiental.","OAJ",0,null,null,6,5,"3299-900-14-3299060-Servicio de implementación sistemas de gestión",null,null,null,null,null,null,null,null,null,null,null,null,"Áreas bajo esquemas de producción sostenible (restauración, conservación, sistemas silvopastoriles, sistemas agroforestales, piscicultura, reconversión productiva) - Pacto Región Pacífico",null,"O15 - Porcentaje de la superficie cubierta por bosque natural","Porcentaje de avance en el proceso de desarrollo de la estrategia de formación y capacitación en NVS",null,null,"Implementar el Registro de Sustancias Químicas y del Registro de Emisiones y Transferencia de Contaminantes - RETC","D2 - El Ministerio de Ambiente y Desarrollo Sostenible concertará con las autoridades  indígenas el diseño, formulación e implementación  de estrategias de conservación y restauración  en la Sierra Nevada de Santa Marta,  para el desarrollo de un portafolio de planes, programas y proyectos de conservación ambiental, articulado con los planes de vida y la Ley de Origen.",null,null,null,null,null,null,null,null,null,null,null,null,null,null,"Putumayo","BARBOSA",null,null,null,null,null,"Delimitación Paramo Almorzadero","ACUMULADAS 68001-31-87-003-2019-00039-02 Y  68432-31-89-001-2019-00041-03","ACCION DE TUTELA - Delimitación Paramo Almorzadero en el marco de un proceso de participación ambiental - BUCARAMANGA","DBBSE; RECURSO HIDRICO; SEP; COMUNICACIONES; NEGOCIOS VERDES"]
[null,null,null,null,null,7,2,3,"8.2.3. Incorporar las modificaciones pertinentes al esquema y capacidad institucional del sector, para mejorar la ejecución de proyectos y fortalecer la vigilancia y regulación\noportuna y diferenciada a las empresas",3,2,4,3,"4.2.4.3. Impulso a la economía forestal",1,1,2,2,2,"4.1.2.2.2 Diseñar los módulos de consumo del agua y huella hídrica para sectores prioritarios \n",null,"IMPLEMENTACIÓN DE ESTRATEGIAS DE LA POLÍTICA NACIONAL DE EDUCACIÓN AMBIENTAL Y PARTICIPACIÓN HACIA LA GOBERNANZA AMBIENTAL EN COLOMBIA.  NACIONAL REC 11",null,null,null,32,1,"OAJ - REC11  - Fortalecimiento de la gestión institucional de la secretaría general del Ministerio de Ambiente y Desarrollo Sostenible.","OAJ",500000000,null,null,6,6,"3299-900-14-3299057-Documentos de lineamientos técnicos",null,null,null,null,null,null,null,null,null,null,null,null,"Iniciativas de carbono azul para el uso sostenible de los manglares en implementación - Pacto Región Caribe",null,"O15 - Áreas en proceso de restauración","Porcentaje de avance en el proceso de desarrollo documento con diagnóstico y propuesta de instrumentos para el fomento de NVS.",null,null,"Imponer gravámenes a productos agroquímicos","D6 - El Ministerio de Ambiente y Desarrollo Sostenible –MADS- en coordinación con las Autoridades ambientales  y las  autoridades indígenas, definirá unos lineamientos y orientaciones para ser incluidos en los planes de ordenamiento y desarrollo de las entidades territoriales correspondientes,  que garanticen el manejo de las condiciones especiales de tipo ambiental, ecológico, biológico, hídrico y cultural de la Sierra Nevada de Santa Marta.",null,null,null,null,null,null,null,null,null,null,null,null,null,null,"Quindío","BELLO",null,null,null,null,null,"Delimitación Paramo de Pisba","15238333300220180001600","ACCION TUTELA PISBA - Delimitación Paramo de Pisba - DUITAMA","DIRECCION DE BOSQUES, HIDRICO, NEGOCIOS VERDES, EDUCACION Y PARTICIPACION DAASU Y SECRETARIA GENERAL  \n"]
[null,null,null,null,null,7,2,4,"8.2.4. Adoptar medidas para proteger las fuentes de agua y garantizar su sostenibilidad en el tiempo, con un enfoque de Economía Circular",3,2,4,4,"4.2.4.4. Turismo sostenible",1,1,2,2,3,"4.1.2.2.3 Optimizar el tratamiento de aguas residuales municipales incorporando en el RAS lineamientos para nuevas tecnologías y regulando la prestación regional de este servicio a través de la desintegración vertical.",null,"FORTALECIMIENTO EN EL CONTROL Y SEGUIMIENTO A LOS COMPROMISOS ADQUIRIDOS EN ESCENARIOS INTERNACIONALES DE LA GESTIÓN AMBIENTAL.  NACIONAL  REC 11",null,null,null,null,null,null,null,null,null,null,6,7,"3299-900-14-3299057-Documentos de lineamientos técnicos",null,null,null,null,null,null,null,null,null,null,null,null,"Áreas bajo esquemas de producción sostenible (restauración, conservación, sistemas silvopastoriles, sistemas agroforestales, piscicultura, reconversión productiva) - Pacto Región Caribe",null,"O15 - Proporción de especies críticamente amenazadas","Porcentaje de avance en el proceso de actualización de herramienta de verificación",null,null,"Inclusión de ecosistemas subrepresentados en áreas protegidas (especialmente marinos)","D7 - 1. Prorrogar en concertación con las autoridades indígenas en el marco de la hoja de ruta, el  plazo para las medidas dispuestas  en la Resolución No. 0504 de 2018 \"Por la cual se declara y delimita una zona de protección de desarrollo de los recursos naturales renovables y del medio ambiente en inmediaciones del Parque Natural Sierra Nevada de Santa Marta\", sujeto a la concertación con las autoridades indígenas.\n2. En el marco de la hoja de ruta y las instancias definidas,  se revisará y  evaluará la pertinencia de ampliación de la figura de protección.",null,null,null,null,null,null,null,null,null,null,null,null,null,null,"Risaralda","BELMIRA",null,null,null,null,null,"Desplazamiento forzado","201000064 T-082 DE 2011","ACCION DE TUTELA  - Desplazamiento forzado  - CALI ","SIN IDENTIFICAR"]
[null,null,null,null,null,7,2,5,"8.2.5. Educar a Colombia sobre el valor del agua para la vida y su adecuado uso, así como la importancia del aprovechamiento de los residuos y los beneficios de la participación ciudadana en el mejoramiento de los servicios",3,3,1,1,"4.3.1.1. Generación de conocimiento",1,1,2,2,4,"4.1.2.2.4 Implementar un programa para fortalecer la capacidad de las autoridades ambientales en el control y vigilancia de vertimientos con acciones estratégicas focalizadas en la jurisdicción de cinco autoridades ambientales.",null,"FORTALECIMIENTO DE LOS PROCESOS DE PLANEACION, EVALUACION Y SEGUIMIENTO A LA GESTION ADELANTADA POR EL SECTOR AMBIENTAL NACIONAL REC 11",null,null,null,null,null,null,null,null,null,null,7,1,"3201-900-3-320100300-Servicio de asistencia técnica para la consolidación de negocios verdes ",null,null,null,null,null,null,null,null,null,null,null,null,"Iniciativas de biotecnología y bioprospección iniciadas en la reserva de Biosfera Seaflower - Pacto Seaflower Region",null,"O15 - Proporción de especies amenazadas","Número de negocios verdes y sostenibles verificados",null,null,"Incorporar criterios ambientales en los planes de uso del suelo, particularmente en zonas rurales y costeras","E45 - Conformar un equipo interinstitucional liderado por el MADS  y los pueblos indígenas para revisar el marco jurídico de la ley 2º de 1959 y presentar recomendaciones sobre este tema para la Amazonía.",null,null,null,null,null,null,null,null,null,null,null,null,null,null,"San Andres","BETANIA",null,null,null,null,null,"Desplazamiento forzado","201000064 T-082 DE 2011","ACCION DE TUTELA  - Desplazamiento forzado  - CALI ","SIN IDENTIFICAR"]
[null,null,null,null,null,7,2,6,"8.2.6. Optimizar los recursos financieros del sector de APSB a través del desarrollo de nuevos mecanismos de focalización, para el otorgamiento de subsidios y la inclusión de instrumentos de financiación de proyectos",3,3,1,2,"4.3.1.2. Escalonamiento y gradualidad",1,1,2,2,5,"4.1.2.2.5 Liderar la creación de la Gerencia Estratégica de la Cuenca del Rio Bogota y del Fondo Común de Cofinanciación para su desarrollo.",null,"FORTALECIMIENTO DE LA GESTIÓN INSTITUCIONAL DE LA SECRETARÍA GENERAL DEL MINISTERIO DE AMBIENTE Y DESARROLLO SOSTENIBLE.  BOGOTÁ  REC 11",null,null,null,null,null,null,null,null,null,null,7,2,"3201-900-3-320100300-Servicio de asistencia técnica para la consolidación de negocios verdes ",null,null,null,null,null,null,null,null,null,null,null,null,"Puntos de monitoreo en ríos Bogotá y Chicamocha con índice de calidad del agua (ICA) \"malo\" - Pacto Región Central",null,"O15 - Proporción de especies vulnerables","Número de guías ambientales actualizadas",null,null,"Incrementar el gravamen por contaminación de agua para aumentar ingresos a invertir en infraestructura de tratamiento de aguas residuales","E62 - El MADS realizará un trabajo conjunto con los PI  de la Amazonía colombiana en el marco de la MRA para analizar, estudiar y generar recomendaciones con base en el documento  sobre conocimientos tradicionales. ",null,null,null,null,null,null,null,null,null,null,null,null,null,null,"Santander","BETULIA",null,null,null,null,null,"Desvío del cauce del Arroyo Bruno","T-5.443.609                                                          \n11001318702020150000900 \nSU – 698 DE 2017 (REVISIÓN CORTE CONSTITUCIONAL) ","ACCION DE TUTELA (ARROYO BRUNO) - Caso en que accionantes consideran vulnerados sus derechos fundamentales con ocasión del proyecto de desvío del cauce del Arroyo Bruno que adelanta el Cerrejón - GUAJIRA ","HÍDRICO, DAASU, CAMBIO CLIMATICO, BOSQUES "]
[null,null,null,null,null,8,1,1,"12.1.1. Participación y construcción de convivencia",3,3,1,3,"4.3.1.3. Seguimiento y evaluación para el cambio climático",1,1,2,3,1,"4.1.2.3.1 Implementar el programa de gestión de pasivos ambientales, para lo cual se presentará el proyecto de Ley con los aspectos jurídicos para el desarrollo del programa. Igualmente, se diseñarán y adoptarán los protocolos y guías técnicas de identificación, prevención e intervención de pasivos ambientales, el plan de acción con las prioridades de intervención, el sistema de información y la estrategia financiera que incluya recursos del Sistema General de Regalías y una subcuenta del Fondo Nacional Ambiental",null,"FORTALECIMIENTO DE LA ESTRATEGIA DE TI Y TRANSFORMACIÓN DIGITAL EN EL MINISTERIO DE AMBIENTE Y DESARROLLO SOSTENIBLE NACIONAL  REC 11",null,null,null,null,null,null,null,null,null,null,7,3,"3201-900-3-320100700-Servicio de divulgación de la incorporación de consideraciones ambientales en la planificación sectorial",null,null,null,null,null,null,null,null,null,null,null,null,"Puntos de monitoreo con índice de calidad del agua (ICA) \"malo\" (ríos suarez, Pamplonita y Opón) - Pacto Región Santanderes",null,null,"Porcentaje de avance en la definición de la estrategia de la cadena de valor que estimulen la creación de empresas orientadas al crecimiento verde en los planes departamentales de extensión agropecuaria.",null,null,"Integrar criterios ambientales en políticas de redistribución de tierras y reforma agraria","E67 - Fortalecer las iniciativas locales de aprovechamiento forestal de los recursos naturales (uso de la biodiversidad) de manera sostenible por los pueblos indígenas en los territorios indígenas.",null,null,null,null,null,null,null,null,null,null,null,null,null,null,"Sucre","BRICEÑO",null,null,null,null,null,"Diagnóstico de fauna y flora Resguardo indígena de Mondó-Mondocito.","27001312100120160000100","ORDINARIO-RESTITUCION DE TIERRAS - Elabore un diagnóstico sobre la fauna y flora existente en el resguardo indígena de Mondó-Mondocito. - CHOCO","BOSQUES"]
[null,null,null,null,null,9,1,1,"13.1.1. Plan Nacional de Accesibilidad",3,3,2,1,"4.3.2.1. Desarrollo territorial con criterios de adaptación y reducción del riesgo\nde desastres",1,1,2,3,2,"4.1.2.3.2 Generar conocimiento sobre el estado físico y químico del suelo",null,"IMPLEMENTACIÓN DE LAS ESTRATEGIAS, INSTRUMENTOS Y RECOMENDACIONES DE LA OCDE EN MATERIA DE GESTIÓN AMBIENTAL A NIVEL NACIONAL REC 11",null,null,null,null,null,null,null,null,null,null,7,4,"3201-900-3-320100700-Servicio de divulgación de la incorporación de consideraciones ambientales en la planificación sectorial",null,null,null,null,null,null,null,null,null,null,null,null,"Áreas bajo esquemas de conservación y producción sostenible (restauración, conservación, sistemas silvopastoriles, sistemas agroforestales, piscicultura, reconversión productiva) - Pacto Región Santanderes",null,null,"\nPorcentaje de avance en el desarrollo del programa de acreditación de actividades agropecuarias ",null,null,"Intensificar esfuerzos para mejorar calidad y relevancia de datos ambientales y sistemas de información para formulación de políticas","A1 - El gobierno a través del ministerio de ambiente y desarrollo sostenible formulara e implementará un programa de restauración, conservación de ecosistemas que faciliten la adaptación al cambio climático en los territorios colectivos y/o ancestrales.",null,null,null,null,null,null,null,null,null,null,null,null,null,null,"Tolima","BURITICA",null,null,null,null,null,"Elección miembros Consejo Directivo Car","11001032800020190001700","NULIDAD ELECTORAL - Elección miembros Consejo Directivo Car - BOGOTA","DIRECCIÓN DEL SINA"]
[null,null,null,null,null,10,1,1,"16.1.1. Lograr el desarrollo urbano equilibrado mediante el aprovechamiento de la ciudad construida, la planificación de la expansión y suburbanización con criterios de sostenibilidad y la optimización de los instrumentos de financiamiento",3,3,2,2,"4.3.2.2. Sectores resilientes y adaptados",1,1,2,4,1,"4.1.2.4.1 Implementar el Programa de Gestión de Sustancias Químicas de Uso Industrial",null,"IMPLEMENTACIÓN DE LA ESTRATEGIA DE DIVULGACIÓN Y COMUNICACIÓN DE LA INFORMACIÓN AMBIENTAL A NIVEL  NACIONAL  REC 11",null,null,null,null,null,null,null,null,null,null,8,1,"3299-900-16-3299054-Documentos de Planeación",null,null,null,null,null,null,null,null,null,null,null,null,"Familias campesinas beneficiadas por actividades agroambientales con acuerdos de conservación de bosques -  Pacto Región Amazonia",null,null,"Porcentaje de avance en la implementación de la estrategia de fortalecimiento",null,null,"Marco regulatorio coherente interinstitucionalmente con sector de minería, de energía y de agricultura","A4 - Financiar la ordenación de cuencas hidrográficas de territorios colectivos titulados, no titulados y ancestrales a través de las autoridades ambientales competentes, de acuerdo con los criterios de priorización, en el marco del decreto 1640 de 2012.",null,null,null,null,null,null,null,null,null,null,null,null,null,null,"Valle del Cauca","CACERES",null,null,null,null,null,"Estudios de impacto y diagnóstico ambientales de alternativas ante los proyectos que se planifican implementar en la zona (Chocó)","T129-2011","ORDINARIO-RESTITUCION DE TIERRAS - Trabajo articulado desplieguen las medidas necesarias para conservar y proteger el medio ambiente en las zonas ampliamente referidas en esta providencia, en especial verificando de forma exhaustiva el cumplimiento serio de los estudios de impacto y diagnóstico ambientales de alternativas ante los proyectos que se planifican implementar en la zona. - CHOCO","BOSQUES"]
[null,null,null,null,null,10,2,1,"16.2.1. Fomentar las capacidades de gestión fiscal para promover el fortalecimiento de los ingresos",3,3,3,1,"4.3.3.1. Movilización de recursos para la gestión del riesgo de desastres",1,1,2,4,2,"4.1.2.4.2 Implenetar el Programa de Prevención de Accidentes Mayores , para medir el desempeño de los sectores asociado a la implementación de estos programas",null,null,null,null,null,null,null,null,null,null,null,null,8,2,"3299-900-16-3299054-Documentos de Planeación",null,null,null,null,null,null,null,null,null,null,null,null,"Áreas bajo esquemas de conservación y producción sostenible (restauración, conservación, sistemas silvopastoriles, sistemas agroforestales, piscicultura, reconversión productiva) -  Pacto Región Amazonia",null,null,"Porcentaje de avance en el proceso de formulación e implementación de proyectos enfocados en el uso eficiente del agua, la difusión y transferencia de buenas prácticas",null,null,"Medidas para implementar estrategia sobre biotecnología y uso sostenible de biodivesidad\n","A5 - Implementar el programa de gestores ambientales para el desarrollo de proyectos etnoambientales con asistencia técnica y económica para su desarrollo en coordinación con todas las entidades del SINA y los consejos comunitarios y organizaciones de las comunidades negras, afro, raizales y palenqueras según corresponda a sus funciones",null,null,null,null,null,null,null,null,null,null,null,null,null,null,"Vaupés","CAICEDO",null,null,null,null,null,"Falla geológica - prevención y atención de desastres","11001333103520100012101","ACCION POPULAR - Falla geológica - prevención y atención de desastres - CAQUEZA","GESTION DEL RIESGO -  SINA                                                  "]
[null,null,null,null,null,10,2,2,"16.2.2. Promover la eficiencia en el gasto público territorial",3,3,3,2,"4.3.3.2. Protección financiera ante desastres",1,1,2,4,3,"4.1.2.4.3 Implementar gradualmente el Registro de Emisiones y Transferencia de Contaminantes.",null,null,null,null,null,null,null,null,null,null,null,null,8,3,"3299-900-16-3299056-Documentos normativos",null,null,null,null,null,null,null,null,null,null,null,null,"Áreas afectadas por el desarrollo de actividades ilegales en proceso de restauración - Pacto Eje Cafetero y Antioquia",null,null,"Porcentaje de avance en la implementación del Programa",null,null,"Medidas para proteger áreas terrestres y marinas","A7 - MinAmbiente en coordinación con las autoridades ambientales e institutos de investigación, promoverá el uso eficiente de aguas, suelo y biodiversidad en los territorios de comunidades negras, afrocolombianas, palenqueras y raizales teniendo en cuenta sus usos y costumbres.",null,null,null,null,null,null,null,null,null,null,null,null,null,null,"Vichada","CALDAS",null,null,null,null,null,"Glifosato T-080/17","50001220400020150010900      SENTENCIA T-080/17 EXPEDIENTE T-5.120.337\n","TUTELA - Glifosato T-080/17 - MIRAFLORES - GUAVIARE","DIRECCIÓN DE ASUNTOS AMBIENTALES, SECTORIAL Y URBANA DAASU"]
[null,null,null,null,null,11,1,1,"1.1.1. Participación activa y liderazgo en la gobernanza de los grandes temas y desafíos de la agenda global que afectan a Colombia, y apuesta por el multilateralismo en defensa de la paz, la seguridad y la democracia",3,4,1,1,"4.4.1.1. CAR: reforma, fortalecimiento y financiación",1,1,2,4,4,"4.1.2.4.4 Desarrollar un plan para la eliminación del consumo de sustancias agotadoras de la capa de ozono",null,null,null,null,null,null,null,null,null,null,null,null,8,4,"3299-900-16-3299057-Documentos de lineamientos técnicos",null,null,null,null,null,null,null,null,null,null,null,null,"Áreas bajo esquemas de conservación y producción sostenible (restauración, conservación, sistemas silvopastoriles, sistemas agroforestales, piscicultura, reconversión productiva) - Pacto Región Llanos-Orinoquia",null,null,"Porcentaje de avance en el proceso de evaluación de la tasa retributiva",null,null,"Medidas para proteger especies endémicas y biodiversidad amenazada","A12 - El MADS promoverá acciones encaminadas a fortalecer los conocimientos, usos, costumbres, saberes y prácticas tradicionales de comunidades negras asociadas a la conservación de la biodiversidad, bosques y ecosistemas",null,null,null,null,null,null,null,null,null,null,null,null,null,null,null,"CAMPAMENTO",null,null,null,null,null,"Glifosato T-236/17","27001110200020130017601  T-236/17  EXPEDIENTE T-4.245.959\n\n","TUTELA - Glifosato T-236/17  - NOVITA - CHOCO","DIRECCIÓN DE ASUNTOS AMBIENTALES, SECTORIAL Y URBANA DAASU"]
[null,null,null,null,null,11,1,2,"1.1.2. Política migratoria integral para facilitar la movilidad de los colombianos y hacer de Colombia un polo de atracción para el retorno y la migración calificada",3,4,1,2,"4.4.1.2. Fortalecer el proceso de licenciamiento ambiental y la evaluación de permisos y otros instrumentos de control ambiental",1,1,2,4,5,"4.1.2.4.5 Implementar el Plan Único Nacional de Mercurio. De manera complementaria se implementará la certificación para el oro legalmente extraído",null,null,null,null,null,null,null,null,null,null,null,null,8,5,"3299-900-16-3299060-Servicio de implementación sistemas de gestión",null,null,null,null,null,null,null,null,null,null,null,null,"Porcentaje de estaciones de monitoreo de aguas marinas con categorías aceptable y óptima - Pacto Región Océanos ",null,null,"Porcentaje de avance en el proceso de desarrollo de un módulo de información sobre la TUA y la TR en el SIRH",null,null,"Promover participación pública en procesos de Estudios de Impacto Ambiental","A13 - En coordinación y articulación con las entidades del SINA y en coordinación con los consejos comunitarios de comunidades negras y organizaciones de comunidades negras según corresponda, se implementarán programas ambientales que fortalezcan las practicas ecológicas y ambientales en territorios de comunidades negras afrocolombianas, raizales y palenqueras.",null,null,null,null,null,null,null,null,null,null,null,null,null,null,null,"CAÑASGORDAS",null,null,null,null,null,"Glifosato T-300/2017","T-300 DE 2017  EXPEDIENTE T-4.615.032","TUTELA - Glifosato T-300/2017 - ","DIRECCION DE ASUNTOS AMBIENTALES, SECTORIAL Y URBANO - DAASU"]
[null,null,null,null,null,12,1,1,"7.1.1. Impulsar la transformación digital de la administración pública.",3,4,2,1,"4.4.2.1. Mecanismos de articulación y coordinación para la sostenibilidad",1,1,3,1,1,"4.1.3.1.1 Definir la estrategia nacional de economía circular dirigida al sector industrial que incorpore ecodiseño, ecoinnovación y simbiosis industrial; y liderar su implementación en cuatro sectores.",null,null,null,null,null,null,null,null,null,null,null,null,9,1,"3299-900-17-3299054-Documentos de Planeación",null,null,null,null,null,null,null,null,null,null,null,null,"Acuerdos para el aprovechamiento local de plásticos y otros materiales reciclables en municipios costeros de los litorales Pacífico y Caribe (continental e insular) en implementación - Pacto Región Océanos",null,null,"Porcentaje de avance en el proceso de implementación de la estrategia de promoción del reúso del agua",null,null,"Realizar análisis para evaluar necesidad de licencias ambientales para exploración minera y otras actividades","A17 - El Ministerio de Ambiente y Desarrollo Sostenible coordinará con las entidades del SINA y del orden nacional el acompañamiento a los entes territoriales para impulsar la formulación de acciones y proyectos orientados a la prevención de riesgos de desastres y gestión del cambio climático entre los que se considere la erosión costera coordinado con los consejos comunitarios y organizaciones de las comunidades negras afros raizales y palenqueras donde corresponda. Líder: MADS",null,null,null,null,null,null,null,null,null,null,null,null,null,null,null,"CARACOLI",null,null,null,null,null,"Impacto ambiental de los cultivos de caña, existentes en las veredas Lomitas.","190013121001201400022 -1900131001201400028-190013121001201400029-190013121001201400030-190013121001201400052","ORDINARIO-RESTITUCION DE TIERRAS - Evaluar el impacto ambiental de los cultivos de caña, existentes en las veredas Lomitas, y que adopten en forma perentoria las medidas necesarias para mitigarlo - POPAYAN","DAASU- ANDRES PINILLA"]
[null,null,null,null,null,13,1,1,"25.1.1. Fortalecimiento del rol articulador de la Comisión Colombiana del Océano",3,4,2,2,"4.4.2.2. Ajustes para el fortalecimiento institucional para la sostenibilidad",1,1,3,1,2,"4.1.3.1.2 Diseño de incentivos para la logística inversa en el sector privado",null,null,null,null,null,null,null,null,null,null,null,null,9,2,"3299-900-17-3299054-Documentos de Planeación",null,null,null,null,null,null,null,null,null,null,null,null,null,null,null,"Porcentaje de avance en el proceso de implementación de la estrategia",null,null,"Reforzar rol del MADS como líder SINA ","A28 - Acordar modelos de coordinación entre las comunidades negras, afrocolombianas, raizales y palenqueras y Parques Nacionales Naturales de Colombia para la planeación, el manejo y la gestión de las áreas protegidas administradas por PNNC, relacionadas con territorios de uso de estas comunidades.",null,null,null,null,null,null,null,null,null,null,null,null,null,null,null,"CARAMANTA",null,null,null,null,null,"Impactos ambientales causados sobre fuentes hídricas cobertura vegetal, cultivos y biodiversidad",201700058,"RESTITUCIÓN DE TIERRAS - Identificación de los impactos ambientales causados sobre fuentes hídricas cobertura vegetal, cultivos y biodiversidad - PASTO","DIRECCIÓN DE BOSQUES, BIODIVERSIDAD Y SERVICIOS ECO SISTÉMICOS – “DBBSE”, DIRECCIÓN DE ASUNTOS AMBIENTALES SECTORIAL Y URBANA“DAASU”, DIRECCIÓN  GENERAL DE ORDENAMIENTO TERRITORIAL Y COORDINACIÓN DEL SISTEMA NACIONAL AMBIENTAL –SINA.- DOATC."]
[null,null,null,null,null,13,1,2,"25.1.2. Desarrollo del Sistema Nacional de Seguridad Integral Marítima, Fluvial y Portuaria",3,4,3,1,"4.4.3.1. Educación para la transformación ambiental",1,1,3,1,3,"4.1.3.1.3 Desarrollo de proyectos de investigación sobre potenciales usos productivos para materiales de difícil aprovechamiento ",null,null,null,null,null,null,null,null,null,null,null,null,9,3,"3299-900-17-3299057-Documentos de lineamientos técnicos",null,null,null,null,null,null,null,null,null,null,null,null,null,null,null,"Porcentaje de avance en el desarrollo de lineamientos para la promoción de la participación de la demanda",null,null,"Reglamentar la política de gestión integral de residuos","A33 - MinAmbiente, propone incluir en el PND el siguiente articulo:\nArtículo xxxxx. Aplicación del incentivo de pago por servicios ambientales (PSA) en Consejos Comunitarios u organizaciones de base de comunidades negras, afrocolombianas, raizales y palenqueras. Para el diseño e implementación de proyectos de PSA en sus territorios de que trata el artículo 3 del Decreto Ley 870 de 2017, se aplicará lo establecido por el Decreto 1007 de 2018 y las norma que le modifique o complemente, y adicionalmente se tendrá en cuenta las siguientes consideraciones:\n1. Los proyectos de PSA en territorios de comunidades negras, afrodescendientes, raizales y palenqueras serán de carácter voluntario entre las partes, reconocerán las prácticas tradicionales de producción, estarán en armonía con los instrumentos de planificación propios y garantizarán la adecuada participación, autonomía y libre autodeterminación de las comunidades étnicas.",null,null,null,null,null,null,null,null,null,null,null,null,null,null,null,"CAREPA",null,null,null,null,null,"Inversión de recursos del Sistema General de Participaciones en Servicios Públicos",201900001,"TUTELA - Vulneración derechos fundamentales por inversión de recursos del Sistema General de Participaciones en Servicios Públicos  - VILLARICA-TOLIMA","HIDRICO Y GESTION DEL RIESGO "]
[null,null,null,null,null,13,1,3,"25.1.3. Actualización del marco normativo que regula el derecho marítimo y el ejercicio de las actividades marítimas en Colombia",3,4,3,2,"4.4.3.2. Participación para contribuir a la prevención de los conflictos socioambientales",1,1,3,1,4,"4.1.3.1.4 Establecer un mecanismo para mejorar la cobertura y efectividad del ecoetiquetado y del Sello Ambiental Colombiano para su posicionamiento en mercados internacionales, y definir directrices para las compras públicas de productos que incorporen criterios de ecodiseño y con alto porcentaje de materiales reciclados.",null,null,null,null,null,null,null,null,null,null,null,null,10,1,"3207-900-2-3207001-Documentos de lineamientos técnicos para la gestión integral de mares, costas y recursos acuáticos ",null,null,null,null,null,null,null,null,null,null,null,null,null,null,null,"Porcentaje de avance en el proceso de actualización de la Política",null,null,"Regular la eliminación de plomo en materiales didácticos y pinturas","A38 - Los proyectos de conservación y producción sostenible que se presenten como una alternativa de la deforestación en territorios priorizados de comunidades Negras, Afrocolombianas, Raizales Y Palenqueras, una vez formulados, viabilizados e inscritos en el banco de programas y proyectos de inversión nacional, el MinAmbiente los promoverá para acceder a las diferentes fuentes de financiación de orden nacional y de cooperación internacional, entre ellos el Fondo Colombia Sostenible, Banco Mundial, Fondo Noruego, entre otros.  ",null,null,null,null,null,null,null,null,null,null,null,null,null,null,null,"CAROLINA",null,null,null,null,null,"Lago de Tota.","1500023300020050020300","ACCION POPULAR - Contaminación y control de la elodea del Lago de Tota. - TUNJA","BOSQUES                                                                     HIDRICO                                                           NEGOCIOS VERDES"]
[null,null,null,null,null,13,1,4,"25.1.4. Conservación y restauración de los ecosistemas marinos",3,4,3,3,"4.4.3.3. Gestión de conflictos socioambientales",1,1,3,1,5,"4.1.3.1.5 Modificar a partir de la evaluación de la normatividad vigente la reglamentación sobre reúso del agua tratada, teniendo en cuenta criterios e información técnica aportada por los sectores e impulsar la transferencia de tecnologías para este fin.",null,null,null,null,null,null,null,null,null,null,null,null,10,2,"3207-900-2-3207002-Documentos normativos para la gestión integral de mares, costas y recursos acuáticos ",null,null,null,null,null,null,null,null,null,null,null,null,null,null,null,"Guía Publicada",null,null,"Revisar implementación de política nacional ambiental para el desarrollo sostenible de espacios oceánicos y zonas costeras e insulares",null,null,null,null,null,null,null,null,null,null,null,null,null,null,null,null,"CAUCASIA",null,null,null,null,null,"Lago Guamuez","52001233300020170007000","ACCIÓN POPULAR - Contaminación por aguas residuales que desembocan en el Lago Guamuez corregimiento de El Encano, Laguna de la Cocha. - 2011-673","SUBDIRECCION DE EDUCACION Y PARTICIPACIÓN ESTA ENCARGA DE REALIZAR LA RESPECTIVA CAMPAÑA, // EL CONSEJO DE ESTADO MEDIANTE FALLO DEL 1 DE AGOSTO DE 2019, CONFIRMA LA DECISIÓNES DEL TRIBUNAL Y MODIFICA EL INCISO PRIMERO DEL NUMERAL 3 DE LA SENTENCIA DEL 26 DE JUNIO DE 2018 QUE FUE PROFERIDA POR EL TRIBUNAL ADMINISTRATIVO DE NARIÑO."]
[null,null,null,null,null,13,2,1,"25.2.1. Expediciones científicas interdisciplinarias e interinstitucionales",3,4,3,4,"4.4.3.4. Cumplimiento de las sentencias relacionadas con la extracción ilícita de minerales, la deforestación y degradación ambiental",1,1,3,1,6,"4.1.3.1.6 Elaborar un instrumento técnico con los lineamientos para potencializar el uso del agua lluvia, con énfasis en zonas con estrés hídrico.",null,null,null,null,null,null,null,null,null,null,null,null,10,3,"3207-900-2-3207003-Documentos de planeación para la gestión integral de mares, costas y recursos acuáticos ",null,null,null,null,null,null,null,null,null,null,null,null,null,null,null,"Número de capacitaciones realizadas",null,null,null,null,null,null,null,null,null,null,null,null,null,null,null,null,null,null,null,"CHIGORODO",null,null,null,null,null,"Minería ilegal Buenaventura","76109333300220100002200","POPULAR - Minería ilegal - BUENAVENTURA","DIRECCIÓN DE ASUNTOS AMBIENTALES, SECTORIAL Y URBANA DAASU"]
[null,null,null,null,null,13,2,2,"25.2.2. Investigación de CT&I aplicada al conocimiento y desarrollo oceánico",3,4,4,1,"4.4.4.1. Consolidación del Sistema de Información Ambiental de Colombia",1,1,3,1,7,"4.1.3.1.7 Evaluar la efectividad de los programas de responsabilidad extendida del productor con más de cinco años de implementación, analizar la inclusión de nuevas corrientes de residuos y establecer los mecanismos para monitorear la gestión de estos residuos.",null,null,null,null,null,null,null,null,null,null,null,null,10,4,"3207-900-2-3207017-Servicio de articulación institucional para el manejo marino, costero e insular colombiano",null,null,null,null,null,null,null,null,null,null,null,null,null,null,null,"Número de acuerdos macro o instrumentos de agregación de demanda con criterios de sostenibilidad",null,null,null,null,null,null,null,null,null,null,null,null,null,null,null,null,null,null,null,"CISNEROS",null,null,null,null,null,"Minería irregular en el municipio de San Carlos Córdoba","23001233300020110011201","ACCION POPULAR - Minería irregular en el municipio de San Carlos Córdoba - MONTERÍA","SINA: ORDENAMIENTO TERRITORIAL; GESTION DEL RIESGO; DAASU"]
[null,null,null,null,null,13,2,3,"25.2.3. Fortalecimiento de capacidades en gente de mar",3,4,4,2,"4.4.4.2. Gestión de información y estadísticas para sectores estratégicos para el crecimiento verde y la sostenibilidad",1,1,3,1,8,"4.1.3.1.8 Reglamentar los sistemas de recolección y gestión de residuos de aparatos eléctricos y electrónicos.",null,null,null,null,null,null,null,null,null,null,null,null,11,1,"3203-900-2-3203028-\nServicio  de asistencia técnica para la implementación de lineamientos priorizados de los Planes Estrategicos de las Macrocuencas\n",null,null,null,null,null,null,null,null,null,null,null,null,null,null,null,"Porcentaje de avance en la elaboración de la propuesta metodológica de la cuenta de flujos de materiales en el marco de la Cuenta Satélite Ambiental",null,null,null,null,null,null,null,null,null,null,null,null,null,null,null,null,null,null,null,"CIUDAD BOLIVAR",null,null,null,null,null,"Minería Tutela 445/2016","TUTELA 445 DE 2016 EXPEDIENTE  T-5.498.864","TUTELA - Minería - ARMENIA","DIRECCIÓN DE ASUNTOS AMBIENTALES, SECTORIAL Y URBANA DAASU"]
[null,null,null,null,null,13,3,1,"25.3.1. Desarrollo y promoción de la industria astillera",3,4,4,3,"4.4.4.3. Información integrada y de fácil acceso en materia ambiental, del riesgo de desastres y ante el cambio climático",1,1,3,1,9,"4.1.3.1.9 Implementar una estrategia para promover la economía circular de la corriente de plásticos y otros materiales de un solo uso con acciones estratégicas focalizadas en zonas costeras e insular, de manera articulada con el desarrollo del programa posconsumo de envases y empaques Y realizará una evaluación intermedia al 2022.",null,null,null,null,null,null,null,null,null,null,null,null,11,2,"3203-900-2-3203030-Servicio de seguimiento de los procesos ordenación y manejo de cuencas hídrgograficas",null,null,null,null,null,null,null,null,null,null,null,null,null,null,null,"Porcentaje de avance en el seguimiento y acompañamiento metodológico de identificación de brechas de capital humano.",null,null,null,null,null,null,null,null,null,null,null,null,null,null,null,null,null,null,null,"COCORNA",null,null,null,null,null,"Minorías étnicas del Chocó","27001233100020160009700","ACCION DE TUTELA - Protección derechos fundamentales a la vida, a la salud, a la igualdad y a la protección de los niños, perteneciente a las minorías étnicas del Chocó - CHOCO","HIDRICO DAASU,"]
[null,null,null,null,null,13,3,2,"25.3.2. Fortalecimiento del abanderamiento de buques",4,1,1,1,"9.1.1.1. Marco legal claro y estable con instrumentos ambientales diferenciados",1,1,3,2,1,"4.1.3.2.1 Fomentar el aprovechamiento, reciclaje y tratamiento de residuos con la definición de criterios para la ubicación de infraestructura de recuperación de materiales y avanzar en la implementación de proyectos tipo para su financiación con enfoque de cierre de ciclos. Adicionalmente, incluir los costos ambientales y la remuneración el aprovechamiento y el tratamiento en los marcos tarifarios por parte de la Comisión de Regulación de Agua Potable y Saneamiento Básico.",null,null,null,null,null,null,null,null,null,null,null,null,11,3,"3203-900-2-3203032-Servicio de asistencia técnica  para la implementación de lineamientos priorizados de las Aguas Subterraneas del País",null,null,null,null,null,null,null,null,null,null,null,null,null,null,null,"Número de reportes de seguimiento al estado de implementación de la Política de Crecimiento Verde",null,null,null,null,null,null,null,null,null,null,null,null,null,null,null,null,null,null,null,"CONCEPCION",null,null,null,null,null,"Municipio de Garagoa","15001233100020110007101","ACCIÓN POPULAR - Planta de tratamiento de residuos sólidos del municipio de Garagoa - TUNJA","DIRECCIÓN DE ASUNTOS AMBIENTALES SECTORIAL Y URBANA "]
[null,null,null,null,null,13,3,3,"25.3.3. Desarrollo de puertos,embarcaderos y marinas náuticas",4,1,1,2,"9.1.1.2. Institucionalidad moderna y coordinada",1,1,3,2,2,"4.1.3.2.2 Establecer los lineamientos en el Reglamento de Agua y Saneamiento (RAS) para el aprovechamiento de biosólidos y biogás generados en el tratamiento de aguas residuales municipales y promover su implementación.",null,null,null,null,null,null,null,null,null,null,null,null,11,4,"3203-900-2-3203033-Servicio de asistencia técnica para la promoción del uso eficiente y ahorro del agua",null,null,null,null,null,null,null,null,null,null,null,null,null,null,null,"Porcentaje de implementación Sistema de Información de Planificación y Gestión Ambiental de las Corporaciones Autónomas Regionales (SIPGA-CAR)",null,null,null,null,null,null,null,null,null,null,null,null,null,null,null,null,null,null,null,"CONCORDIA",null,null,null,null,null,"Niños Wayuu","44001221400220160000300  TUTELA 302 DE 2017 EXPEDIENTE  T-5.697.370","TUTELA - Niños Wayuu - RIOHACHA","DIRECCION DE GESTION INTEGRAL DEL RECURSO HIDRICO"]
[null,null,null,null,null,13,3,4,"25.3.4. Desarrollo de la industria offshore",4,2,1,1,"9.2.1.1. Viabilidad de nuevas fuentes de hidrocarburos",1,1,3,2,3,"4.1.3.2.3 Ajustar el reglamento colombiano de construcción sismorresistente para viabilizar el uso de agregados reciclados de concreto y pétreos mixtos en la construcción de infraestructura y generar instrumentos de promoción y aplicación.",null,null,null,null,null,null,null,null,null,null,null,null,11,5,"3203-900-2-3203034-Servicio de asistencia técnica para la implementación de lineamientos sobre el mejoramiento de la calidad del recurso hídrico",null,null,null,null,null,null,null,null,null,null,null,null,null,null,null,"Porcentaje de implementación de Documento de lineamientos de  Política y  Protocolo para la Gestión de Datos de Información actualizado.",null,null,null,null,null,null,null,null,null,null,null,null,null,null,null,null,null,null,null,"COPACABANA",null,null,null,null,null,"Oso Chucho","11001020500020170095800 EXPEDIENTE T-6480577","TUTELA - Oso Chucho - BOGOTA","DIRECCION DE BOSQUES, BIODIVERSIDAD Y SERVICIOS ECOSISTEMICOS "]
[null,null,null,null,null,null,null,null,null,4,2,1,2,"9.2.1.2. Definición de un marco regulatorio para los proyectos geotérmicos",1,1,4,1,1,"4.1.4.1.1 Establecer los lineamientos para la participación de los agentes del sector de servicios energéticos en el mercado de eficiencia energética.",null,null,null,null,null,null,null,null,null,null,null,null,11,6,"3203-900-2-3203035-Servicio de implementación de mecanismos y herramientas de conocimiento y manejo de la información para la Gestión Integral del Recurso Hídrico",null,null,null,null,null,null,null,null,null,null,null,null,null,null,null,null,null,null,null,null,null,null,null,null,null,null,null,null,null,null,null,null,null,null,null,"DABEIBA",null,null,null,null,null,"Páramo de Sumapaz - Cruz Verde","11001333704020190025700","ACCIÓN DE TUTELA (SUMAPAZ - CRUZ VERDE) - Páramo de Sumapaz - Cruz Verde - BOGOTÁ","BOSQUES "]
[null,null,null,null,null,null,null,null,null,4,2,1,3,"9.2.1.3. Aprovechamiento de bioenergía",1,1,4,1,2,"4.1.4.1.2 Facilitar el acceso a recursos financieros de crédito para que las industrias incorporen mejores tecnologías y prácticas ambientales, buscando la transición hacia la sostenibilidad. ",null,null,null,null,null,null,null,null,null,null,null,null,11,7,"3203-900-2-3203036-Servicio de implementación de herramientas nacionales de comunicación, divulgación y cualificación de actores ",null,null,null,null,null,null,null,null,null,null,null,null,null,null,null,null,null,null,null,null,null,null,null,null,null,null,null,null,null,null,null,null,null,null,null,"DON MATIAS",null,null,null,null,null,"Parque Natural Los Farallones","76001233100020040065600","ACCION POPULAR - Parque Natural Los Farallones - CALI","DIRECCIÓN DE BOSQUES, BIODIVERSIDAD Y SERVICIOS ECOSISTEMICOS."]
[null,null,null,null,null,null,null,null,null,4,2,2,1,"9.2.2.1. Refinación y calidad",1,1,4,1,3,"4.1.4.1.3 Desarrollar instrumentos de financiación para la implementación de proyectos productivos agropecuarios sostenibles y ajustará aquellos que financien actividades intensivas en el uso de recursos y que generen impactos ambientales; adicionalmente, en coordinación con Finagro revisará y ajustará los incentivos existentes para fomentar la agricultura ecológica y agroecológica.",null,null,null,null,null,null,null,null,null,null,null,null,11,8,"3203-900-2-3203037-Servicio de asistencia técnica para el desarrollo de estrategias sobre la efectiva gobernaza del agua",null,null,null,null,null,null,null,null,null,null,null,null,null,null,null,null,null,null,null,null,null,null,null,null,null,null,null,null,null,null,null,null,null,null,null,"EBEJICO",null,null,null,null,null,"Parque Tayrona y Pescadores","470123330120140035100 ACUMULADO CON 470123330120110038400 T-606 DE 2015","TUTELA - Restauración y protección al Parque Tayrona y Pescadores  - SANTA MARTA","PLAN MAESTRO -DAMCRA, BOSQUES,DAASU PAN DE COMPENSACIÓN- PLANEACIÓN RECURSOS "]
[null,null,null,null,null,null,null,null,null,4,2,2,2,"9.2.2.2. Aprovechamiento de la hidroenergía y el carbón para la confiabilidad del Sistema Interconectado Nacional",1,1,4,1,4,"4.1.4.1.4 Desarrollar la metodología para fortalecer el seguimiento a las inversiones en cambio climático, incluidos los bonos verdes y otros instrumentos económicos, así como las inversiones climáticas internacionales encaminadas hacia el cumplimiento de la NDC.",null,null,null,null,null,null,null,null,null,null,null,null,12,1,"3205-900-2-3205001-Documentos de lineamientos técnicos para el ordenamiento ambiental territorial",null,null,null,null,null,null,null,null,null,null,null,null,null,null,null,null,null,null,null,null,null,null,null,null,null,null,null,null,null,null,null,null,null,null,null,"EL BAGRE",null,null,null,null,null,"Pesca caracol pala","88001333100120060011900","ACCIÓN POPULAR - Pesca caracol pala - SAN ANDRÉS","DAMCRA"]
[null,null,null,null,null,null,null,null,null,5,1,1,1,"5.1.1.1. Consolidar un arreglo institucional para el fomento de la CTeI",1,1,4,2,1,"4.1.4.2.1 Implementar la estrategia de financiamiento climático que incluya la identificación de nuevos esquemas financieros e instrumentos fiscales y no fiscales y de mercado para para impulsar el desarrollo de programas, proyectos y medidas de reducción de emisiones de GEI en todos los sectores productivos",null,null,null,null,null,null,null,null,null,null,null,null,12,2,"3205-900-2-3205006-Servicio de divulgación y socialización ambiental en el marco del ordenamiento ambiental territorial",null,null,null,null,null,null,null,null,null,null,null,null,null,null,null,null,null,null,null,null,null,null,null,null,null,null,null,null,null,null,null,null,null,null,null,"EL CARMEN DE VIBORAL",null,null,null,null,null,"Plan de restauración ambiental por daños por glifosato y minería ilegal","86001312100120150068200"," RESTITUCION DE TIERRAS  - El plan de restauración ambiental para lograr la solución y remediación de estos daños por glifosato y minería ilegal - MOCOA","BOSQUES Y DAASU"]
[null,null,null,null,null,null,null,null,null,6,1,1,1,"6.1.1.1. Fortalecer el sistema portuario colombiano, sus accesos y sus servicios marítimos.",1,1,4,2,2,"4.1.4.2.2 Reglamentar la ley de cambio climático y desarrollar mecanismos de mercado para el cumplimiento de las metas de cambio climático, para lo cual se diseñará el programa nacional de cupos transables de emisión de GEI armonizado con los instrumentos económicos existentes, como el impuesto al carbono. ",null,null,null,null,null,null,null,null,null,null,null,null,12,3,"3205-900-2-3205022-Servicios de asistencia técnica en planificación y gestión ambiental",null,null,null,null,null,null,null,null,null,null,null,null,null,null,null,null,null,null,null,null,null,null,null,null,null,null,null,null,null,null,null,null,null,null,null,"EL SANTUARIO",null,null,null,null,null,"Presunto daño ecológico originado por la explotación de material del Río Magdalena","25307333170120100021701","ACCIÓN POPULAR - Presunto daño ecológico originado por la explotación de material del Río Magdalena en la zona denominada isla del sol en el municipio de Ricaurte Cundinamarca. - MUCIPIO DE RICAURTE","SIN IDENTIFICAR"]
[null,null,null,null,null,null,null,null,null,7,1,1,1,"8.1.1.1. Gestión eficiente de recursos energéticos",1,1,4,2,3,"4.1.4.2.3 Diseño del componente de contabilidad de reducciones de emisiones y remociones de GEI corporativas en el marco del sistema de monitoreo, reporte y verificación de las acciones de mitigación, ",null,null,null,null,null,null,null,null,null,null,null,null,13,1,"3208-900-2-3208001-Servicio de coordinación de alianzas nacionales para el desarrollo de la política nacional ambiental y la participación en la gestión ambiental",null,null,null,null,null,null,null,null,null,null,null,null,null,null,null,null,null,null,null,null,null,null,null,null,null,null,null,null,null,null,null,null,null,null,null,"ENTRERRIOS",null,null,null,null,null,"Prohibición pesca artesanal e industrial de tiburón","88001233100220110000900","ACCIÓN POPULAR - Prohibición pesca artesanal e industrial de tiburón - SAN ANDRÉS","DAMCRA"]
[null,null,null,null,null,null,null,null,null,7,2,1,1,"8.2.1.1. Promover la modernización del Servicio Público de Aseo",1,1,4,3,1,"4.1.4.3.1 Establecer programas para la implementación efectiva de las tasas ambientales incluyendo las tasas por uso de agua y retributiva por vertimientos puntuales","FORTALECIMIENTO INSTITUCIONAL PARA LA IMPLEMENTACIÓN DE LA POLÍTICA NACIONAL PARA LA GESTIÓN INTEGRAL DEL RECURSO HÍDRICO NACIONAL REC10",null,null,null,null,null,null,null,null,null,null,null,13,2,"3208-900-2-3208005-Documentos de lineamientos técnicos para el desarrollo de la política nacional ambiental y la participación en la gestión ambiental",null,null,null,null,null,null,null,null,null,null,null,null,null,null,null,null,null,null,null,null,null,null,null,null,null,null,null,null,null,null,null,null,null,null,null,"ENVIGADO",null,null,null,null,null,"Protección del territorio de la comunidad y",201400005,"ORDINARIO-RESTITUCION DE TIERRAS - Protección del territorio de la comunidad y  - QUIBDO","DAASU Y BOSQUES"]
[null,null,null,null,null,null,null,null,null,7,2,2,1,"8.2.2.1. Generar herramientas técnicas que faciliten la implementación de soluciones alternativas de agua potable, manejo de aguas residuales y residuos sólidos en las zonas rurales y PDET",1,1,4,3,2,"4.1.4.3.2 Reglamentar la tasa de emisiones por fuentes móviles entre MinAmbiente y MinTransporte. ","FORTALECIMIENTO INSTITUCIONAL PARA LA IMPLEMENTACIÓN DE LA POLÍTICA NACIONAL PARA LA GESTIÓN INTEGRAL DEL RECURSO HÍDRICO NACIONAL REC 11",null,null,null,null,null,null,null,null,null,null,null,13,3,"3208-900-2-3208006-Servicio de asistencia técnica para la implementación de las  estrategias educativo ambientales y de participación",null,null,null,null,null,null,null,null,null,null,null,null,null,null,null,null,null,null,null,null,null,null,null,null,null,null,null,null,null,null,null,null,null,null,null,"FREDONIA",null,null,null,null,null,"Protección resguardo indígena Llanos del Yarí - Yaguara II",201700121,"ORDINARIO-RESTITUCION DE TIERRAS - Auto interlocutorio 0263 medida cautelar protección resguardo indígena Llanos del Yarí - Yaguara II  - IBAGUE","BOSQUES, ORDENAMIENTO, SEP"]
[null,null,null,null,null,null,null,null,null,7,2,3,1,"8.2.3.1. Potencializar la institucionalidad en la planeación, priorización y estructuración de proyectos de APSB",1,1,4,3,3,"4.1.4.3.3 Implementar un esquema de monitoreo y evaluación de la eficiencia en la implementación de la tasa por uso del agua y la tasa retributiva.","CONSERVACION DE LA BIODIVERSIDAD Y LOS SERVICIOS ECOSISTÉMICOS A NIVEL NACIONAL REC 10",null,null,null,null,null,null,null,null,null,null,null,13,4,"3208-900-2-3208008-Servicio de divulgación de la información de la política nacional de educación ambiental y participación",null,null,null,null,null,null,null,null,null,null,null,null,null,null,null,null,null,null,null,null,null,null,null,null,null,null,null,null,null,null,null,null,null,null,null,"FRONTINO",null,null,null,null,null,"Proyecto productivo de sostenibilidad ambiental","85001312100120150002200","RESTITUCION DE TIERRAS - Proyecto productivo de sostenibilidad ambiental  - BOGOTA","NEGOCIOS VERDES"]
[null,null,null,null,null,null,null,null,null,7,2,4,1,"8.2.4.1. Potenciar el uso sostenible de agua subterránea como fuente de abastecimiento de acueductos",1,2,1,1,1,"4.2.1.1.1 Conformar el Consejo Nacional de Lucha contra la Deforestación, orientar acciones de control y vigilancia y adoptar el Protocolo Interinstitucional de Lucha contra la Deforestación. ","CONSERVACION DE LA BIODIVERSIDAD Y LOS SERVICIOS ECOSISTÉMICOS A NIVEL NACIONAL REC 11",null,null,null,null,null,null,null,null,null,null,null,14,1,"3299-900-9-3299006-Servicios de comunicación",null,null,null,null,null,null,null,null,null,null,null,null,null,null,null,null,null,null,null,null,null,null,null,null,null,null,null,null,null,null,null,null,null,null,null,"GIRALDO",null,null,null,null,null,"Proyecto vial Rumichaca-Pasto-Chachagüí","52001233100020110067301","ACCIÓN POPULAR - Proyecto vial Rumichaca-Pasto-Chachagüí - PASTO","N/A"]
[null,null,null,null,null,null,null,null,null,7,2,4,2,"8.2.4.2. Incrementar el aprovechamiento de las aguas residuales, diversificando las alternativas técnicas de reúso",1,2,1,1,2,"4.2.1.1.2 Avanzar en el desarrollo de normas y procedimientos que faciliten la judicialización de los grupos ilegales alrededor de la deforestación.","FORMULACION ADMINISTRACION DE LOS RECURSOS FONAM PARA EL USO SOSTENIBLE Y PROTECCION DE LAS ESPECIES CITES  NACIONAL  -  FONAM REC 20",null,null,null,null,null,null,null,null,null,null,null,15,1,"3201-900-5-3201001-Documentos de política para el fortalecimiento del desempeño ambiental de los sectores productivos",null,null,null,null,null,null,null,null,null,null,null,null,null,null,null,null,null,null,null,null,null,null,null,null,null,null,null,null,null,null,null,null,null,null,null,"GIRARDOTA",null,null,null,null,null,"Pueblo Cumaral","EXPEDIENTE T-6.298.958 \n201701198\nSU 095 DE 2018","ACCION DE TUTELA - Consulta al Pueblo Cumaral para explotación de hidrocarburos y minería  - BOGOTA","DAASU  Y EDUCACION Y PARTICION/GRUPO DE RIESGOS DELA DIRECCION DE CAMBIO CLIMATICO Y MINISTERIO DE MINAS Y ENERGÍA-MME, AL MINISTERIO DE AMBIENTE Y DESARROLLO-MADS, A LA AUTORIDAD NACIONAL DE LICENCIAS AMBIENTALES-ANLA, A LA AGENCIA NACIONAL DE MINERÍA ANM, A LA AGENCIA NACIONAL DE HIDROCARBUROS-ANH, A LA UNIDAD DE PLANEACIÓN MINERO ENERGÉTICA UPME, AL SERVICIO GEOLÓGICO COLOMBIANO SGC"]
[null,null,null,null,null,null,null,null,null,7,2,4,3,"8.2.4.3. Fortalecer el programa SAVER para garantizar la calidad de las fuentes receptoras-abastecedoras",1,2,1,1,3,"4.2.1.1.3 Formular una política que permita reducir la deforestación y degradación de los bosques,  atendiendo las causas directas y subyacentes, reconozca las dinámicas particulares de las regiones (con prioridad en los núcleos de alta deforestación NAD ) y se armonice con el plan de acción del Pacto Intergeneracional por la Vida del Amazonas Colombiano (PIVAC). Así mismo, se deberá incluir mecanismos de monitoreo y seguimiento de la gestión sectorial, especialmente frente al rol de la fuerza pública. Con este fin, se configurará la Fuerza de Reacción Integral Ambiental (FRIA).","CONSERVACION DE CUENCAS HIDROGRAFICAS ABASTECEDORAS DE ACUEDUCTOS MUNICIPALES A NIVEL NACIONAL  FONAM REC 20",null,null,null,null,null,null,null,null,null,null,null,15,2,"3201-900-5-3201002-Documentos de lineamientos técnicos para el fortalecimiento del desempeño ambiental de los sectores productivos",null,null,null,null,null,null,null,null,null,null,null,null,null,null,null,null,null,null,null,null,null,null,null,null,null,null,null,null,null,null,null,null,null,null,null,"GOMEZ PLATA",null,null,null,null,null,"Pueblo Nukak-Maku","50001312100120180007000","ORDINARIO-RESTITUCION DE TIERRAS - Regreso del pueblo Nukak-Maku - SAN JOSE DE GUAVIARE // VILLAVICENCIO META","BOSQUES Y DAASU "]
[null,null,null,null,null,null,null,null,null,7,2,5,1,"8.2.5.1. Definir los requisitos mínimos de los programas educativos para el uso eficiente de agua y manejo de los residuos sólidos",1,2,1,1,4,"4.2.1.1.4 Ajustar y modernizar los sistemas de información, salvoconductos y autorizaciones, entre otros instrumentos para facilitar a las autoridades el control efectivo a la cadena comercial forestal.","FORTALECIMIENTO DE LA GESTIÓN AMBIENTAL SECTORIAL Y URBANA, A NIVEL , NACIONAL -  REC 10\nBLOQUEADO",null,null,null,null,null,null,null,null,null,null,null,15,3,"3201-900-5-3201002-Documentos de lineamientos técnicos para el fortalecimiento del desempeño ambiental de los sectores productivos",null,null,null,null,null,null,null,null,null,null,null,null,null,null,null,null,null,null,null,null,null,null,null,null,null,null,null,null,null,null,null,null,null,null,null,"GRANADA",null,null,null,null,null,"Recuperación de la zona de reserva forestal protectora de las quebradas San Juan y El Peñón","73001333100520070020000","POPULAR - Recuperación de la zona de reserva forestal protectora, declarada por el Ministerio de Agricultura el 19 de diciembre de 1960, de las quebradas San Juan y El Peñón, municipio de San Sebastián de Mariquita - Tolima - IBAGUE","DIRECCION DE BOSQUES."]
[null,null,null,null,null,null,null,null,null,7,2,6,1,"8.2.6.1. Internalización de costos ambientales asociados a la gestión de residuos sólidos",1,2,1,1,5,"4.2.1.1.5 Desarrollar una estrategia eque contenga los arreglos institucionales necesarios para apoyar las acciones de las autoridades ambientales y de policía, para prevenir y combatir las dinámicas ilegales que afectan los ecosistemas, especialmente las asociadas a cultivos de uso ilícito en áreas prioritarias de conservación de biodiversidad.","FORTALECIMIENTO DE LA GESTIÓN AMBIENTAL SECTORIAL Y URBANA, A NIVEL , NACIONAL -  REC 10",null,null,null,null,null,null,null,null,null,null,null,15,4,"3201-900-5-3201010-Servicio de divulgación de la incorporación de consideraciones ambientales en la planificación sectorial",null,null,null,null,null,null,null,null,null,null,null,null,null,null,null,null,null,null,null,null,null,null,null,null,null,null,null,null,null,null,null,null,null,null,null,"GUADALUPE",null,null,null,null,null,"Recuperación del Rio Bogotá","´25000231500020010047902","ACCION POPULAR - Recuperación del Rio Bogotá - BOGOTÁ   \"RIO BOGOTA\"","TODAS LAS AREAS DEL MADS"]
[null,null,null,null,null,null,null,null,null,8,1,1,1,"12.1.1.1. Promover la resolución de conflictos interétnicos, intraétnicos e interculturales",1,2,1,2,1,"4.2.1.2.1 Implementar una estrategia que materialice el cierre y estabilización de la frontera agrícola","FORTALECIMIENTO DE LA GESTIÓN AMBIENTAL SECTORIAL Y URBANA, A NIVEL , NACIONAL -  REC 11",null,null,null,null,null,null,null,null,null,null,null,15,5,"3201-900-5-3201010-Servicio de divulgación de la incorporación de consideraciones ambientales en la planificación sectorial",null,null,null,null,null,null,null,null,null,null,null,null,null,null,null,null,null,null,null,null,null,null,null,null,null,null,null,null,null,null,null,null,null,null,null,"GUARNE",null,null,null,null,null,"Recuperación Humedal Meandro del Say","´25000231500020000011201","POPULAR - Recuperación Humedal Meandro del Say - BOGOTA","DIRECCION DE BOSQUES."]
[null,null,null,null,null,null,null,null,null,9,1,1,1,"13.1.1.1. Formulación e implementación del Plan Nacional de Accesibilidad",1,2,1,2,2,"4.2.1.2.2 Formular el plan nacional de zonificaciòn ambiental incorporando acciones de reconversión y sustitución de actividades y donde se definan los lineamientos para la creación y adopción de regímenes de transición para la resolución de conflictos socioambientales en estas áreas.","IMPLEMENTACIÓN DE LAS ESTRATEGIAS, INSTRUMENTOS Y RECOMENDACIONES DE LA OCDE EN MATERIA DE GESTIÓN AMBIENTAL A NIVEL NACIONAL REC 10\nBLOQUEADO",null,null,null,null,null,null,null,null,null,null,null,15,6,"3201-900-5-3201012-Documentos de política para mejorar la calidad ambiental de las áreas urbanas",null,null,null,null,null,null,null,null,null,null,null,null,null,null,null,null,null,null,null,null,null,null,null,null,null,null,null,null,null,null,null,null,null,null,null,"GUATAPE",null,null,null,null,null,"Reserva Forestal Rio Leon",201300571,"ORDINARIO-RESTITUCION DE TIERRAS - Plan de manejo ambiental de la Reserva Forestal Rio Leon - APARTADO- RESERVA FORESTAL PROTECTORA RIO LEON","BOSQUES"]
[null,null,null,null,null,null,null,null,null,10,1,1,1,"16.1.1.1. Aprovechamiento de la ciudad construida y planificación de la expansión y suburbanización",1,2,1,2,3,"4.2.1.2.3 Implementar Acuerdos Cero Deforestación desde MinAmbiente y MinAgricultura con actores de las cadenas de valor de lácteos, carne, madera, cacao y palma de aceite para diferenciar la producción nacional en el mercado internacional con mecanismos de trazabilidad.","IMPLEMENTACIÓN DE LAS ESTRATEGIAS, INSTRUMENTOS Y RECOMENDACIONES DE LA OCDE EN MATERIA DE GESTIÓN AMBIENTAL A NIVEL NACIONAL REC 10",null,null,null,null,null,null,null,null,null,null,null,15,7,"3201-900-5-3201013-Documentos de lineamientos técnicos para mejorar la calidad ambiental de las áreas urbanas",null,null,null,null,null,null,null,null,null,null,null,null,null,null,null,null,null,null,null,null,null,null,null,null,null,null,null,null,null,null,null,null,null,null,null,"HELICONIA",null,null,null,null,null,"Reserva forestal-medio Cerro Dapa","76001233300120150045800//CE 76001233300020150045801","ACCION POPULAR - Sustracción de facto de reserva forestal-medio Cerro Dapa - CALI","BOSQUES"]
[null,null,null,null,null,null,null,null,null,10,2,1,1,"16.2.1.1. Promover incentivos a la conservación ambiental",1,2,1,2,4,"4.2.1.2.4 Incorporar criterios para reducir la deforestación y degradación de ecosistemas en la implementación de los Planes Maestros de Transporte Intermodal, de los Planes Viales Departamentales y del Plan Nacional de Vías","IMPLEMENTACIÓN DE LAS ESTRATEGIAS, INSTRUMENTOS Y RECOMENDACIONES DE LA OCDE EN MATERIA DE GESTIÓN AMBIENTAL A NIVEL NACIONAL REC 11",null,null,null,null,null,null,null,null,null,null,null,15,8,"3201-900-5-3201010-Servicio de divulgación de la incorporación de consideraciones ambientales en la planificación sectorial",null,null,null,null,null,null,null,null,null,null,null,null,null,null,null,null,null,null,null,null,null,null,null,null,null,null,null,null,null,null,null,null,null,null,null,"HISPANIA",null,null,null,null,null,"Resguardo indígena - proyectos de infraestructura","T-011 DE 2019","TUTELA - Consulta previa- resguardo indígena - proyectos de infraestructura - BARRANQUILLA","DOAT-SINA ( COORDINACIÓN CRAUTONOMA) Y DEL SECTOR: ANLA"]
[null,null,null,null,null,null,null,null,null,10,2,2,1,"16.2.2.1. Identificar de manera articulada entre las entidades competentes, una propuesta de ajuste a la estrategia de MSC al uso de los recursos del SGP",1,2,1,2,5,"4.2.1.2.5 Priorizar los territorios afectados por deforestación en la implementación del sistema catastral multipropósito. ","FORTALECIMIENTO FORTALECER LA GESTIÓN AMBIENTAL DEL ESTADO COLOMBIANO SOBRE LAS ZONAS MARINAS Y COSTERAS Y RECURSOS ACUÁTICOS NACIONAL REC 10\nBLOQUEADOS",null,null,null,null,null,null,null,null,null,null,null,16,1,"3202-900-7-3202005-Servicio de restauración de ecosistemas",null,null,null,null,null,null,null,null,null,null,null,null,null,null,null,null,null,null,null,null,null,null,null,null,null,null,null,null,null,null,null,null,null,null,null,"ITAGUI",null,null,null,null,null,"Resguardo indígena Urada",201700075,"RESTITUCION DE TIERRAS - Medida cautelar a favor del resguardo indígena Urada Jiguamiandó Unidad Administrativa de Gestión de Restitución de Tierras Dirección Territorial Apartadó. - QUIBDO","BOSQUES"]
[null,null,null,null,null,null,null,null,null,11,1,1,1,"1.1.1.1. La APC formulará e implementará la Estrategia de Cooperación Internacional teniendo en cuenta los lineamientos presidenciales, el Plan Nacional de Desarrollo, los ODS y los lineamientos de Política Exterior. Dentro de esta estrategia, se formulará un protocolo de articulación que permita identificar, gestionar y coordinar la cooperación de ayuda oficial al desarrollo (AOD), la cooperación triangular, Sur-Sur y Col-Col.",1,2,1,2,6,"4.2.1.2.6 Priorizar la aplicación del registro inmobiliario de bienes baldíos en areas arectadas por defoestación, evitando su ocupación indebida y el acaparamiento de tierras. ","FORTALECIMIENTO FORTALECER LA GESTIÓN AMBIENTAL DEL ESTADO COLOMBIANO SOBRE LAS ZONAS MARINAS Y COSTERAS Y RECURSOS ACUÁTICOS NACIONAL REC 10",null,null,null,null,null,null,null,null,null,null,null,16,2,"3202-900-7-3202014-Servicio de educación informal en el marco de la conservación de la biodiversidad y los servicios ecosistémicos",null,null,null,null,null,null,null,null,null,null,null,null,null,null,null,null,null,null,null,null,null,null,null,null,null,null,null,null,null,null,null,null,null,null,null,"ITUANGO",null,null,null,null,null,"Resguardos indígenas Motilón Barí y Catalaura la Gabarra","54001 3104004201400116 \nT-052 DE 2017 ","ACCION DE TUTELA  - Solicitudes de ampliación, saneamiento y delimitación de los resguardos indígenas Motilón Barí y Catalaura la Gabarra  - CUCUTA ","DOAT "]
[null,null,null,null,null,null,null,null,null,11,1,1,2,"1.1.1.3. El Gobierno nacional creará el Sistema Nacional de Cooperación Internacional como estrategia para la orientación y coordinación de las entidades del nivel nacional, departamental, distrital y municipal, así como del sector privado y no gubernamental, para alcanzar la mayor alineación, pertinencia y eficacia de la cooperación internacional no reembolsable y técnica, cuya secretaría técnica será ejercida por APC - Colombia. Las acciones desarrolladas en el marco de este sistema estarán articuladas con la agenda de política exterior.",1,2,1,2,7,"4.2.1.2.7 Desarrollar evaluaciones ambientales estratégicas regionales en zonas de alta deforestación, con el fin de analizar los impactos directos, indirectos, acumulativos y sinérgicos por deforestación y degradación de ecosistemas, así como las medidas para su gestión.","FORTALECIMIENTO FORTALECER LA GESTIÓN AMBIENTAL DEL ESTADO COLOMBIANO SOBRE LAS ZONAS MARINAS Y COSTERAS Y RECURSOS ACUÁTICOS NACIONAL REC 11",null,null,null,null,null,null,null,null,null,null,null,17,1,"3202-900-9-3202013-Servicio de autorización de comercio internacional de especies amenazadas de fauna y flora silvestres",null,null,null,null,null,null,null,null,null,null,null,null,null,null,null,null,null,null,null,null,null,null,null,null,null,null,null,null,null,null,null,null,null,null,null,"JARDIN",null,null,null,null,null,"Restitución tierras Villavicencio","50001312100120170016000"," RESTITUCION DE TIERRAS  -  - VILLAVICENCIO","PARQUES "]
[null,null,null,null,null,null,null,null,null,11,1,1,3,"1.1.1.3. El Gobierno Nacional definirá estrategias para la articulación de la acción Exterior de Colombia, desde el más alto nivel y con la incorporación de los distintos sectores del Estado.",1,2,1,3,1,"4.2.1.3.1 Ajustar el marco regulatorio de las inversiones ambientales obligatorias desde  particularmente la inversión forzosa del 1% y las compensaciones y desarrollar mecanismos para que la ANLA y las autoridades ambientales hagan efectivo su cumplimiento, en especial en el sector minero energético.","FORTALECIMIENTO DE LA GESTIÓN DE CAMBIO CLIMÁTICO EN LA PLANEACIÓN SECTORIAL Y TERRITORIAL NACIONAL REC 10\nBLOOQUEADO",null,null,null,null,null,null,null,null,null,null,null,17,2,"3202-900-9-3202040-Servicio de asistencia técnica para la protección de la fauna y flora silvestre",null,null,null,null,null,null,null,null,null,null,null,null,null,null,null,null,null,null,null,null,null,null,null,null,null,null,null,null,null,null,null,null,null,null,null,"JERICO",null,null,null,null,null,"Restitución y material de los predios denominados el Chimborazo, Cantagallar, las Nigrinis o la Remón y los Ceibones","4700131210022016000300 (JUZGADO CUARTO CIVIL DEL CTO ESPECIALIZADO EN RTIERRAS DE SINCELEJO EN STA MTA) / 70001312100420160003000","RESTITUCIÓN DE TIERRAS  - Restitución y material de los predios denominados el Chimborazo, Cantagallar, las Nigrinis o la Remón y los Ceibones ubicados en el corregimiento de Tierra Nueva, municipio de Pueblo Viejo, departamento del Magdalena, restitución que se ordena en virtud del despojo y abandono forzado de tierras del que fueron víctimas los solicitantes  - SANTA MARTA","HIDRICO - BOSQUES "]
[null,null,null,null,null,null,null,null,null,11,1,2,1,"No Aplica",1,2,1,3,2,"4.2.1.3.2 Desarrollar la Estrategia Nacional de Restauración. La Estrategia deberá priorizar las áreas protegidas, cuencas y ríos estratégicos para el cierre de la frontera agrícola, áreas ambientalmente estratégicas como el Río Atrato y territorios con altas tasas de deforestación. Así mismo, la estrategia deberá facilitar la consolidación de modelos de negocios y cadenas de valor a partir de la restauración.","FORTALECIMIENTO DE LA GESTIÓN DE CAMBIO CLIMÁTICO EN LA PLANEACIÓN SECTORIAL Y TERRITORIAL NACIONAL REC 10",null,null,null,null,null,null,null,null,null,null,null,null,null,null,null,null,null,null,null,null,null,null,null,null,null,null,null,null,null,null,null,null,null,null,null,null,null,null,null,null,null,null,null,null,null,null,null,null,null,"LA CEJA",null,null,null,null,null,"Rio Atrato","T-622 DE 2016","ACCIÓN DE TUTELA - Rio Atrato sujeto de derechos - CHOCO","RECURSO HIDRICO-DAASU-BOSQUES,SINA"]
[null,null,null,null,null,null,null,null,null,12,1,1,1,"7.1.1.1. Diseñar e implementar planes de transformación digital en las entidades públicas del orden nacional.",1,2,1,3,3,"4.2.1.3.3 Implementar plataformas colaborativas que permitan la articulación de las inversiones y acciones públicas y privadas alrededor en las cuencas para la gestión integral del recurso hídrico.","FORTALECIMIENTO DE LA GESTIÓN DE CAMBIO CLIMÁTICO EN LA PLANEACIÓN SECTORIAL Y TERRITORIAL NACIONAL REC 11",null,null,null,null,null,null,null,null,null,null,null,null,null,null,null,null,null,null,null,null,null,null,null,null,null,null,null,null,null,null,null,null,null,null,null,null,null,null,null,null,null,null,null,null,null,null,null,null,null,"LA ESTRELLA",null,null,null,null,null,"Rio Chípalo","73001233300620180000800","ACCION POPULAR - Contaminación Rio Chípalo - IBAGUE","N/A"]
[null,null,null,null,null,null,null,null,null,12,1,1,2,"7.1.1.2. Definir e implementar la infraestructura de datos para generar valor social y económico.",1,2,1,3,4,"4.2.1.3.4 Evaluar el estado de la biodiversidad de Colombia, con el objetivo de conocer las tendencias de cambio y los umbrales de las principales transformaciones socioecológicas (agricultura, vivienda, minas y energía y transporte) en territorios priorizados.","GENERACION CAPACIDADES PARA EL ADECUADO DESEMPEÑO AMBIENTAL DEL SINA  EL TERRITORIO NACIONAL REC 10 ",null,null,null,null,null,null,null,null,null,null,null,null,null,null,null,null,null,null,null,null,null,null,null,null,null,null,null,null,null,null,null,null,null,null,null,null,null,null,null,null,null,null,null,null,null,null,null,null,null,"LA PINTADA",null,null,null,null,null,"Rio Dagua","11001333704220180011900","ACCION DE TUTELA - Vulneración derecho petición con respecto a modificación de zona de manglar para ejecución del proyecto terminal marítimo delta del Rio Dagua. Consulta previa  - BOGOTA D.C.","DAMCRA"]
[null,null,null,null,null,null,null,null,null,13,1,1,1,"No Aplica",1,2,1,3,5,"4.2.1.3.5 Avanzar en la implementación del plan de acción nacional para la lucha contra la desertificación y la sequía en Colombia y del Plan Maestro de Erosión Costera Colombia.","GENERACION CAPACIDADES PARA EL ADECUADO DESEMPEÑO AMBIENTAL DEL SINA  EL TERRITORIO NACIONAL REC 10",null,null,null,null,null,null,null,null,null,null,null,null,null,null,null,null,null,null,null,null,null,null,null,null,null,null,null,null,null,null,null,null,null,null,null,null,null,null,null,null,null,null,null,null,null,null,null,null,null,"LA UNION",null,null,null,null,null,"Rio Lebrija","68001233100020060141000","ACCION POPULAR - Contaminación del Rio Lebrija  - BUCARAMANGA","RECURSO HIDRICO"]
[null,null,null,null,null,null,null,null,null,13,1,2,1,"No Aplica",1,2,2,1,1,"4.2.2.1.1 Formular una política pública que desarrolle la visión a 2030 para consolidar el SINAP,  y establecer los lineamientos para racionalizar la creación de nuevas áreas protegidas, priorizándolas con criterios de representatividad ecológica y se avanzará en el reconocimiento de las estrategias complementarias de conservación.","GENERACION CAPACIDADES PARA EL ADECUADO DESEMPEÑO AMBIENTAL DEL SINA  EL TERRITORIO NACIONAL REC 11",null,null,null,null,null,null,null,null,null,null,null,null,null,null,null,null,null,null,null,null,null,null,null,null,null,null,null,null,null,null,null,null,null,null,null,null,null,null,null,null,null,null,null,null,null,null,null,null,null,"LIBORINA",null,null,null,null,null,"Rio Lejos, la Quebrada Las Pizarras, El Inglés y La Cristalina","63001233300020180003600","ACCION POPULAR - Financiamiento de obras y proyectos para el mejoramiento de la capacidad hidráulica del Rio Lejos, la Quebrada Las Pizarras, El Inglés y La Cristalina del municipio de Pijao - ARMENIA"," DIRECCION DE CAMBIO CLIMATICO -GESTION DEL RIESGO"]
[null,null,null,null,null,null,null,null,null,13,1,3,1,"No Aplica",1,2,2,1,2,"4.2.2.1.2 Implementar el programa Herencia Colombia, para asegurar a largo plazo la capacidad y sostenibilidad financiera de las áreas protegidas y otras estrategias de conservación. dando especial atención a la Orinoquía, al Macizo Colombiano, a la Serranía de San Lucas y a los esfuerzos de conservación in situ por parte de privados y comunitarios.","IMPLEMENTACIÓN DE ESTRATEGIAS DE LA POLÍTICA NACIONAL DE EDUCACIÓN AMBIENTAL Y PARTICIPACIÓN HACIA LA GOBERNANZA AMBIENTAL EN COLOMBIA. NACIONAL REC10\nBLOQUEADO",null,null,null,null,null,null,null,null,null,null,null,null,null,null,null,null,null,null,null,null,null,null,null,null,null,null,null,null,null,null,null,null,null,null,null,null,null,null,null,null,null,null,null,null,null,null,null,null,null,"MACEO",null,null,null,null,null,"Rio Quito","25000232400020110065501","ACCIÓN POPULAR (PAIMADO) - Contaminación Rio Quito por minería ilegal  - QUIBDÓ","DAASU - HÍDRICO"]
[null,null,null,null,null,null,null,null,null,13,1,4,1,"No Aplica",1,2,2,1,3,"4.2.2.1.3 Elaborar una agenda intersectorial con mecanismos de seguimiento para la implementación de los Planes de Manejo Ambiental de las áreas protegidas para el uso sostenible y de las acciones que permitan gestionar los problemas de acceso a tierra y a instrumentos de desarrollo rural.","IMPLEMENTACIÓN DE ESTRATEGIAS DE LA POLÍTICA NACIONAL DE EDUCACIÓN AMBIENTAL Y PARTICIPACIÓN HACIA LA GOBERNANZA AMBIENTAL EN COLOMBIA. NACIONAL REC10",null,null,null,null,null,null,null,null,null,null,null,null,null,null,null,null,null,null,null,null,null,null,null,null,null,null,null,null,null,null,null,null,null,null,null,null,null,null,null,null,null,null,null,null,null,null,null,null,null,"MARINILLA",null,null,null,null,null,"Seguridad, bienestar y desarrollo sostenible de las víctimas de restitución","68001312100120140014801","ORDINARIO-RESTITUCION DE TIERRAS - Seguridad, bienestar y desarrollo sostenible de las víctimas de restitución - BUCARAMNGA","HIDRICO Y GESTIO DEL RIESGO "]
[null,null,null,null,null,null,null,null,null,13,2,1,1,"No Aplica",1,2,2,2,1,"4.2.2.2.1 Avanzar en la reglamentación de la Ley 1930 de 2018","IMPLEMENTACIÓN DE ESTRATEGIAS DE LA POLÍTICA NACIONAL DE EDUCACIÓN AMBIENTAL Y PARTICIPACIÓN HACIA LA GOBERNANZA AMBIENTAL EN COLOMBIA. NACIONAL REC11",null,null,null,null,null,null,null,null,null,null,null,null,null,null,null,null,null,null,null,null,null,null,null,null,null,null,null,null,null,null,null,null,null,null,null,null,null,null,null,null,null,null,null,null,null,null,null,null,null,"MEDELLIN",null,null,null,null,null,"Siembra arboles ornamentales","2014-00166","ORDINARIO-RESTITUCION DE TIERRAS - Siembra arboles ornamentales en predios de víctimas de restitución  - SINCELEJO ","SINA AYUDA CON LA CORPORACION "]
[null,null,null,null,null,null,null,null,null,13,2,2,1,"No Aplica",1,2,2,2,2,"4.2.2.2.2 Formular una política pública para la intervención integral de los complejos de páramo, que cuente con la participación de las entidades territoriales, las autoridades ambientales y las comunidades.","FORTALECIMIENTO DE LA   GESTIÓN INSTITUCIONAL DE LA SECRETARIA GENERAL DEL MINISTERIO DE AMBIENTE Y DESARROLLO SOSTENIBBLE, BOGOTÁ REC 10 \nBLOQUEADO",null,null,null,null,null,null,null,null,null,null,null,null,null,null,null,null,null,null,null,null,null,null,null,null,null,null,null,null,null,null,null,null,null,null,null,null,null,null,null,null,null,null,null,null,null,null,null,null,null,"MONTEBELLO",null,null,null,null,null,"Siembra de árboles frutales, medicinales y ornamentales","70001312100220140016600","PROCESO DE RESTITUCION DE TIERRAS PECHILIN  - Siembra de árboles frutales, medicinales y ornamentales  - SINCELEJO ","LAS AREAS MANIFESTARON QUE NO SOMOS COMPETENTES BOSQUES LA CORPORACION LO ESTA TRAMITANDO DIRECTAMENTE Y A TRÁVES DEL REPRESENTANTE DEL MINAMBIENTE ANTE ELCONSEJO DIRECTIVO DE LA CORPORACION NOS PROPORCIONA LA INFORMACION QUE REMITIMOS"]
[null,null,null,null,null,null,null,null,null,13,2,3,1,"No Aplica",1,2,2,2,3,"4.2.2.2.3 Implementar un programa de ordenamiento productivo y desarrollo de actividades sostenibles en páramos, que reduzcan los impactos ambientales y que incluyan procesos de reconversión con énfasis en los cultivos de cebolla, papa y producción de leche. ","FORTALECIMIENTO DE LA   GESTIÓN INSTITUCIONAL DE LA SECRETARIA GENERAL DEL MINISTERIO DE AMBIENTE Y DESARROLLO SOSTENIBBLE, BOGOTÁ REC 10 ",null,null,null,null,null,null,null,null,null,null,null,null,null,null,null,null,null,null,null,null,null,null,null,null,null,null,null,null,null,null,null,null,null,null,null,null,null,null,null,null,null,null,null,null,null,null,null,null,null,"MURINDO",null,null,null,null,null,"Suspender el trámite o abstenerse de conceder las licencias o permisos Buenavista","INTERLOCUTORIO NO. 00531 DEL 21 DE AGOSTO DE 2018","ORDINARIO-RESTITUCION DE TIERRAS - Las entidades competentes suspender el trámite o abstenerse de conceder las licencias o permisos para la exploración y explotación de hidrocarburos y recursos naturales dentro del territorio correspondientes al territorio Buenavista….” - MOCOA","SIN IDENTIFICAR"]
[null,null,null,null,null,null,null,null,null,13,3,1,1,"No Aplica",1,2,2,2,4,"4.2.2.2.4 Establecer arreglos institucionales a través de los cuales se gestionen los problemas de acceso a tierra a la población campesina en áreas ambientalmente estratégicas, que permitan otorgar derechos de uso y/o propiedad a partir de la titulación o la formalización, con acuerdos e incentivos de conservación.","FORTALECIMIENTO DE LA   GESTIÓN INSTITUCIONAL DE LA SECRETARIA GENERAL DEL MINISTERIO DE AMBIENTE Y DESARROLLO SOSTENIBBLE, BOGOTÁ REC 11",null,null,null,null,null,null,null,null,null,null,null,null,null,null,null,null,null,null,null,null,null,null,null,null,null,null,null,null,null,null,null,null,null,null,null,null,null,null,null,null,null,null,null,null,null,null,null,null,null,"MUTATA",null,null,null,null,null,"Visión Amazonía","250002342000201705028 T-063 DE 2019","TUTELA - Visión Amazonía proyectos - consulta previa  - BOGOTÁ ","VISIÓN AMAZONÍA "]
[null,null,null,null,null,null,null,null,null,13,3,2,1,"No Aplica",1,2,2,2,5,"4.2.2.2.5 Incluir cciones e inversiones nacionales y territoriales en los contratos plan, para la intervención integral de las áreas ambiental estratégicas, con especial atención a humedales RAMSAR como la Ciénaga Grande de Santa Marta y reservas de la biosfera estratégicos de la Nación.","FORTALECIMIENTO EN EL CONTROL Y SSEGUIMIENTO A LOS COMPROMISOS ADQUIRIDOS EN ESCENARIOS INTERNCIONALES DE LA GESTIÓN AMBIENTAL NACIONAL REC 10",null,null,null,null,null,null,null,null,null,null,null,null,null,null,null,null,null,null,null,null,null,null,null,null,null,null,null,null,null,null,null,null,null,null,null,null,null,null,null,null,null,null,null,null,null,null,null,null,null,"NARIÑO"]
[null,null,null,null,null,null,null,null,null,13,3,3,1,"No Aplica",1,2,2,2,6,"4.2.2.2.6 Desarrollar los mecanismos que garanticen la efectiva implementación de los planes de manejo ambiental, en los que se involucren los actores requeridos para garantizar su uso sostenible.","FORTALECIMIENTO EN EL CONTROL Y SSEGUIMIENTO A LOS COMPROMISOS ADQUIRIDOS EN ESCENARIOS INTERNCIONALES DE LA GESTIÓN AMBIENTAL NACIONAL REC 10",null,null,null,null,null,null,null,null,null,null,null,null,null,null,null,null,null,null,null,null,null,null,null,null,null,null,null,null,null,null,null,null,null,null,null,null,null,null,null,null,null,null,null,null,null,null,null,null,null,"NECHI"]
[null,null,null,null,null,null,null,null,null,13,3,4,1,"No Aplica",1,2,2,2,7,"4.2.2.2.7 Construir modelos de desarrollo regional sostenible que promuevan los océanos como activos desarrollará los mecanismos que garanticen la efectiva implementación de los planes de manejo ambiental, en los que se involucren los actores requeridos para garantizar su uso sostenible.","FORTALECIMIENTO EN EL CONTROL Y SSEGUIMIENTO A LOS COMPROMISOS ADQUIRIDOS EN ESCENARIOS INTERNCIONALES DE LA GESTIÓN AMBIENTAL NACIONAL REC 11",null,null,null,null,null,null,null,null,null,null,null,null,null,null,null,null,null,null,null,null,null,null,null,null,null,null,null,null,null,null,null,null,null,null,null,null,null,null,null,null,null,null,null,null,null,null,null,null,null,"NECOCLI"]
[null,null,null,null,null,null,null,null,null,null,null,null,null,null,1,2,2,2,8,"4.2.2.2.8 Promover la inversión de recursos del SGR en proyectos que fomenten alternativas productivas sostenibles en áreas ambientalmente estratégicas, garantizando su articulación con estrategias de conservación y de desarrollo rural sostenible.","FORTALECIMIENTO DE LA OFERTA INSTITUCIONAL PARA LA SOSTENIBILIDAD AMBIENTAL DEL TERRITORIO EN EL MARCO DE LOS NEGOCIOS VERDES Y SOSTENIBLES. NIVEL NACIONAL  REC 10",null,null,null,null,null,null,null,null,null,null,null,null,null,null,null,null,null,null,null,null,null,null,null,null,null,null,null,null,null,null,null,null,null,null,null,null,null,null,null,null,null,null,null,null,null,null,null,null,null,"OLAYA"]
[null,null,null,null,null,null,null,null,null,null,null,null,null,null,1,2,3,1,1,"4.2.3.1.1 Crear un esquema de compensaciones e incentivos para municipios que cuenten con áreas protegidas nacionales y regionales. y establecer mecanismos que faciliten la transferencia de recursos intermunicipales por la conservación de las áreas abastecedoras de acueductos y se incluirá a los municipios de Macizo en la distribución de designaciones de SGP","FORTALECIMIENTO DE LA OFERTA INSTITUCIONAL PARA LA SOSTENIBILIDAD AMBIENTAL DEL TERRITORIO EN EL MARCO DE LOS NEGOCIOS VERDES Y SOSTENIBLES. NIVEL NACIONAL  REC 10",null,null,null,null,null,null,null,null,null,null,null,null,null,null,null,null,null,null,null,null,null,null,null,null,null,null,null,null,null,null,null,null,null,null,null,null,null,null,null,null,null,null,null,null,null,null,null,null,null,"PEÐOL"]
[null,null,null,null,null,null,null,null,null,null,null,null,null,null,1,2,3,1,2,"4.2.3.1.2 Diseñar las bases técnicas y operativas de un incentivo para el emprendimiento y diversificación de economías locales a través de negocios verdes, y un programa de incentivos para la reconversión y sustitución de actividades agropecuarias, que se complementará con los PSA.","FORTALECIMIENTO DE LA OFERTA INSTITUCIONAL PARA LA SOSTENIBILIDAD AMBIENTAL DEL TERRITORIO EN EL MARCO DE LOS NEGOCIOS VERDES Y SOSTENIBLES. NIVEL NACIONAL  REC 11",null,null,null,null,null,null,null,null,null,null,null,null,null,null,null,null,null,null,null,null,null,null,null,null,null,null,null,null,null,null,null,null,null,null,null,null,null,null,null,null,null,null,null,null,null,null,null,null,null,"PEQUE"]
[null,null,null,null,null,null,null,null,null,null,null,null,null,null,1,2,3,1,3,"4.2.3.1.3 Reformar el Certificado de Incentivo Forestal (CIF) de Conservación y el CIF de Plantaciones Forestales Comerciales, asignándoles recursos y garantizando su sostenibilidad financiera, además de potenciar su aplicabilidad en los territorios de acuerdo con su vocación y aptitud.","FORTALECIMIENTO DE LA ESTRATEGIA TI Y TRASNFORMACIÓN DIGITSL EN EL MINISTERIO DE AMBIENTE Y DESARROLLO SOSTENIBLE NACIONAL REC10",null,null,null,null,null,null,null,null,null,null,null,null,null,null,null,null,null,null,null,null,null,null,null,null,null,null,null,null,null,null,null,null,null,null,null,null,null,null,null,null,null,null,null,null,null,null,null,null,null,"PUEBLORRICO"]
[null,null,null,null,null,null,null,null,null,null,null,null,null,null,1,2,3,2,1,"4.2.3.2.1 Implementar  el programa nacional de PSA, el cual priorizará la construcción una estrategia de divulgación, capacitación y asistencia técnica para que los departamentos desarrollen portafolios de proyectos de PSA orientados a las áreas ambientalmente estratégicas, zonas de frontera agrícola y Zonas de Reserva Campesina. ","FORTALECIMIENTO DE LA ESTRATEGIA TI Y TRASNFORMACIÓN DIGITSL EN EL MINISTERIO DE AMBIENTE Y DESARROLLO SOSTENIBLE NACIONAL REC10",null,null,null,null,null,null,null,null,null,null,null,null,null,null,null,null,null,null,null,null,null,null,null,null,null,null,null,null,null,null,null,null,null,null,null,null,null,null,null,null,null,null,null,null,null,null,null,null,null,"PUERTO BERRIO"]
[null,null,null,null,null,null,null,null,null,null,null,null,null,null,1,2,4,1,1,"4.2.4.1.1 Apoyar el desarrollo empresarial en bioeconomía a través de los programas e instrumentos de desarrollo empresarial técnicos y financieros.","FORTALECIMIENTO DE LA ESTRATEGIA TI Y TRASNFORMACIÓN DIGITSL EN EL MINISTERIO DE AMBIENTE Y DESARROLLO SOSTENIBLE NACIONAL REC11",null,null,null,null,null,null,null,null,null,null,null,null,null,null,null,null,null,null,null,null,null,null,null,null,null,null,null,null,null,null,null,null,null,null,null,null,null,null,null,null,null,null,null,null,null,null,null,null,null,"PUERTO NARE"]
[null,null,null,null,null,null,null,null,null,null,null,null,null,null,1,2,4,1,2,"4.2.4.1.2 Implementar el programa Colombia Bio y realizar al menos 25 expediciones continentales y marinas con fines de bioprospección."," CONSOLIDACIÓN SISTEMA DE INFORMACIÓN AMBIENTAL SIAC COMO EJE CENTRAL DE INFORMACIÓN AMBIENTAL OFICIAL Y SOPORTE PAR LA TOMA DE DECISIONES A NIVEL REGIONAL Y NACIONAL Y CONOCIMIENTO EN MATERIA AMBIENTAL A NIVEL NACIONAL Y REGIONAL BOGOTÁ REC10",null,null,null,null,null,null,null,null,null,null,null,null,null,null,null,null,null,null,null,null,null,null,null,null,null,null,null,null,null,null,null,null,null,null,null,null,null,null,null,null,null,null,null,null,null,null,null,null,null,"PUERTO TRIUNFO"]
[null,null,null,null,null,null,null,null,null,null,null,null,null,null,1,2,4,1,3,"4.2.4.1.3 Cosntruir un portafolio nacional de bioproductos con énfasis en escalamiento comercial e identificando oportunidades de inversión."," CONSOLIDACIÓN SISTEMA DE INFORMACIÓN AMBIENTAL SIAC COMO EJE CENTRAL DE INFORMACIÓN AMBIENTAL OFICIAL Y SOPORTE PAR LA TOMA DE DECISIONES A NIVEL REGIONAL Y NACIONAL Y CONOCIMIENTO EN MATERIA AMBIENTAL A NIVEL NACIONAL Y REGIONAL BOGOTÁ REC10",null,null,null,null,null,null,null,null,null,null,null,null,null,null,null,null,null,null,null,null,null,null,null,null,null,null,null,null,null,null,null,null,null,null,null,null,null,null,null,null,null,null,null,null,null,null,null,null,null,"REMEDIOS"]
[null,null,null,null,null,null,null,null,null,null,null,null,null,null,1,2,4,1,4,"4.2.4.1.4 Generar nuevos registros de especímenes en el Global Biodiversity Information Facility (GBIF) a través del SiB Colombia"," CONSOLIDACIÓN SISTEMA DE INFORMACIÓN AMBIENTAL SIAC COMO EJE CENTRAL DE INFORMACIÓN AMBIENTAL OFICIAL Y SOPORTE PAR LA TOMA DE DECISIONES A NIVEL REGIONAL Y NACIONAL Y CONOCIMIENTO EN MATERIA AMBIENTAL A NIVEL NACIONAL Y REGIONAL BOGOTÁ REC 11",null,null,null,null,null,null,null,null,null,null,null,null,null,null,null,null,null,null,null,null,null,null,null,null,null,null,null,null,null,null,null,null,null,null,null,null,null,null,null,null,null,null,null,null,null,null,null,null,null,"RETIRO"]
[null,null,null,null,null,null,null,null,null,null,null,null,null,null,1,2,4,1,5,"4.2.4.1.5 Construir la cuenta satélite de Bioeconomía","FORTALECIMIENTO DE LOS PROCESOS DE PLANEACION, EVALUACION Y SEGUIMIENTO A LA GESTION ADELANTADA POR EL SECTOR AMBIENTAL,  NACIONAL REC10",null,null,null,null,null,null,null,null,null,null,null,null,null,null,null,null,null,null,null,null,null,null,null,null,null,null,null,null,null,null,null,null,null,null,null,null,null,null,null,null,null,null,null,null,null,null,null,null,null,"RIONEGRO"]
[null,null,null,null,null,null,null,null,null,null,null,null,null,null,1,2,4,2,1,"4.2.4.2.1 Desarrollar una estrategia de articulación interinstitucional que contenga el diseño de mecanismos normativos, técnicos y financieros que consoliden las cadenas de valor para los negocios verdes verificados por la autoridad ambiental.","FORTALECIMIENTO DE LOS PROCESOS DE PLANEACION, EVALUACION Y SEGUIMIENTO A LA GESTION ADELANTADA POR EL SECTOR AMBIENTAL,  NACIONAL REC10",null,null,null,null,null,null,null,null,null,null,null,null,null,null,null,null,null,null,null,null,null,null,null,null,null,null,null,null,null,null,null,null,null,null,null,null,null,null,null,null,null,null,null,null,null,null,null,null,null,"SABANALARGA"]
[null,null,null,null,null,null,null,null,null,null,null,null,null,null,1,2,4,2,2,"4.2.4.2.2 Consolidar los espacios para la comercialización y encadenamiento productivo de los negocios verdes y posicionar el comercio de especies CITES, fortaleciendo aquellos negocios con mayor valor agregado.","FORTALECIMIENTO DE LOS PROCESOS DE PLANEACION, EVALUACION Y SEGUIMIENTO A LA GESTION ADELANTADA POR EL SECTOR AMBIENTAL,  NACIONAL REC11",null,null,null,null,null,null,null,null,null,null,null,null,null,null,null,null,null,null,null,null,null,null,null,null,null,null,null,null,null,null,null,null,null,null,null,null,null,null,null,null,null,null,null,null,null,null,null,null,null,"SABANETA"]
[null,null,null,null,null,null,null,null,null,null,null,null,null,null,1,2,4,2,3,"4.2.4.2.3 Implementar una estrategia para el encadenamiento productivo de los negocios verdes, especialmente en áreas ambientalmente estratégicas de uso sostenible, con énfasis en aquellos emprendimientos verdes regionales verificados por la autoridad ambiental.","IMPLEMENTACIÓN DE LA ESTRATEGIA DE DIVULGACION Y COMUNICACIÓN DE LA INFORMACIÓN AMBIENTAL A NIVEL NACIONAL REC10",null,null,null,null,null,null,null,null,null,null,null,null,null,null,null,null,null,null,null,null,null,null,null,null,null,null,null,null,null,null,null,null,null,null,null,null,null,null,null,null,null,null,null,null,null,null,null,null,null,"SALGAR"]
[null,null,null,null,null,null,null,null,null,null,null,null,null,null,1,2,4,3,1,"4.2.4.3.1 Realizar los ajustes institucionales y normativos para el desarrollo de la economía forestal y el fomento de empresas forestales sostenibles, que involucren esquemas de aprovechamiento comunitario de los bosques,  tecnificación de plantaciones con especies nativas y  encadenamientos productivos","IMPLEMENTACIÓN DE LA ESTRATEGIA DE DIVULGACION Y COMUNICACIÓN DE LA INFORMACIÓN AMBIENTAL A NIVEL NACIONAL REC10",null,null,null,null,null,null,null,null,null,null,null,null,null,null,null,null,null,null,null,null,null,null,null,null,null,null,null,null,null,null,null,null,null,null,null,null,null,null,null,null,null,null,null,null,null,null,null,null,null,"SAN ANDRES DE CUERQUIA"]
[null,null,null,null,null,null,null,null,null,null,null,null,null,null,1,2,4,3,2,"4.2.4.3.2 Desarrollar la agenda de investigación forestal en la que se incluya un programa de forestería comunitaria, portafolios de proyectos con iniciativas regionales y locales, y la promoción de sus usos tecnológicos y biotecnológicos para generar mercados de alto valor agregado. ","IMPLEMENTACIÓN DE LA ESTRATEGIA DE DIVULGACION Y COMUNICACIÓN DE LA INFORMACIÓN AMBIENTAL A NIVEL NACIONAL REC11",null,null,null,null,null,null,null,null,null,null,null,null,null,null,null,null,null,null,null,null,null,null,null,null,null,null,null,null,null,null,null,null,null,null,null,null,null,null,null,null,null,null,null,null,null,null,null,null,null,"SAN CARLOS"]
[null,null,null,null,null,null,null,null,null,null,null,null,null,null,1,2,4,3,3,"4.2.4.3.3 Formular e implementar diez planes de negocios forestales sostenibles y restauraciones masivas con participación del sector privado, público y sociedad civil fortalecerán la cultura ambiental.",null,null,null,null,null,null,null,null,null,null,null,null,null,null,null,null,null,null,null,null,null,null,null,null,null,null,null,null,null,null,null,null,null,null,null,null,null,null,null,null,null,null,null,null,null,null,null,null,null,null,"SAN FRANCISCO"]
[null,null,null,null,null,null,null,null,null,null,null,null,null,null,1,2,4,3,4,"4.2.4.3.4 Construir una estrategia para garantizar la integralidad de las cadenas de valor de la madera legal y sus manufacturas en el marco del Pacto Intersectorial por la Madera Legal.",null,null,null,null,null,null,null,null,null,null,null,null,null,null,null,null,null,null,null,null,null,null,null,null,null,null,null,null,null,null,null,null,null,null,null,null,null,null,null,null,null,null,null,null,null,null,null,null,null,null,"SAN JERONIMO"]
[null,null,null,null,null,null,null,null,null,null,null,null,null,null,1,2,4,4,1,"4.2.4.4.1 Promover el turismo de forma responsable y sostenible, a través de programas desensibilización, educación y cultura turística, estímulos y trabajo interinstitucional a nivel nacional y territorial",null,null,null,null,null,null,null,null,null,null,null,null,null,null,null,null,null,null,null,null,null,null,null,null,null,null,null,null,null,null,null,null,null,null,null,null,null,null,null,null,null,null,null,null,null,null,null,null,null,null,"SAN JOSE DE LA MONTAÑA"]
[null,null,null,null,null,null,null,null,null,null,null,null,null,null,1,2,4,4,2,"4.2.4.4.2 Desarrollar productos turísticos diferenciadores y de alto valor, entre los cuales se priorizan el turismo de naturaleza, aventura y el ecoturismo",null,null,null,null,null,null,null,null,null,null,null,null,null,null,null,null,null,null,null,null,null,null,null,null,null,null,null,null,null,null,null,null,null,null,null,null,null,null,null,null,null,null,null,null,null,null,null,null,null,null,"SAN JUAN DE URABA"]
[null,null,null,null,null,null,null,null,null,null,null,null,null,null,1,2,4,4,3,"4.2.4.4.3 Desarrollar estrategias para la atracción de la inversión y el fomento a la consolidación de planta e infraestructura turística sostenible de talla mundial y conectividad regional",null,null,null,null,null,null,null,null,null,null,null,null,null,null,null,null,null,null,null,null,null,null,null,null,null,null,null,null,null,null,null,null,null,null,null,null,null,null,null,null,null,null,null,null,null,null,null,null,null,null,"SAN LUIS"]
[null,null,null,null,null,null,null,null,null,null,null,null,null,null,1,2,4,4,4,"4.2.4.4.4 Mejorar el ambiente de negocios, mediante la promoción de certificaciones de calidad  y sostenibilidad para prestadores y destinos turísticos.",null,null,null,null,null,null,null,null,null,null,null,null,null,null,null,null,null,null,null,null,null,null,null,null,null,null,null,null,null,null,null,null,null,null,null,null,null,null,null,null,null,null,null,null,null,null,null,null,null,null,"SAN PEDRO"]
[null,null,null,null,null,null,null,null,null,null,null,null,null,null,1,2,4,4,5,"4.2.4.4.5 Desarrollar programas para fortalecer las competencias técnicas de prestadores turísticos y demás actores vinculados al turismo, incluyendo de forma transversal la formación en patrimonio natural y cultural, así como en desarrollo sostenible del turismo.",null,null,null,null,null,null,null,null,null,null,null,null,null,null,null,null,null,null,null,null,null,null,null,null,null,null,null,null,null,null,null,null,null,null,null,null,null,null,null,null,null,null,null,null,null,null,null,null,null,null,"SAN PEDRO DE URABA"]
[null,null,null,null,null,null,null,null,null,null,null,null,null,null,1,2,4,4,6,"4.2.4.4.6 Desarrollar una estrategia nacional de turismo sostenible, con énfasis en territorios con atractivos naturales y culturales emblemáticos de la Nación, para promover la concientización ambiental a los visitantes, la generación de oportunidades productivas y de formación local, así como alianzas empresariales y de gestión privada.",null,null,null,null,null,null,null,null,null,null,null,null,null,null,null,null,null,null,null,null,null,null,null,null,null,null,null,null,null,null,null,null,null,null,null,null,null,null,null,null,null,null,null,null,null,null,null,null,null,null,"SAN RAFAEL"]
[null,null,null,null,null,null,null,null,null,null,null,null,null,null,1,3,1,1,1,"4.3.1.1.1 Realizar estudios de amenaza por eventos de remoción en masa, inundación, sequía, incendio forestal, avenida torrencial, erosión costera, volcánicos, sísmicos y tecnológicos, a escala relevante para el nivel municipal, desde las entidades técnico - científicas del SNGRD. y formular un Modelo Nacional de Riesgo Sísmico.",null,null,null,null,null,null,null,null,null,null,null,null,null,null,null,null,null,null,null,null,null,null,null,null,null,null,null,null,null,null,null,null,null,null,null,null,null,null,null,null,null,null,null,null,null,null,null,null,null,null,"SAN ROQUE"]
[null,null,null,null,null,null,null,null,null,null,null,null,null,null,1,3,1,1,2,"4.3.1.1.2 Establecer un Sistema Nacional de Alertas Tempranas ante amenazas hidrometeorológicas, y definir mecanismos para replicar los sistemas de alerta a escalas detalladas con la participación de las autoridades ambientales regionales. Por otra parte, la DIMAR, fortalecerá el Centro Nacional de Alerta contra Tsunamis.",null,null,null,null,null,null,null,null,null,null,null,null,null,null,null,null,null,null,null,null,null,null,null,null,null,null,null,null,null,null,null,null,null,null,null,null,null,null,null,null,null,null,null,null,null,null,null,null,null,null,"SAN VICENTE"]
[null,null,null,null,null,null,null,null,null,null,null,null,null,null,1,3,1,1,3,"4.3.1.1.3 Desarrollar una metodología para la elaboración e inventario de elementos expuestos y vulnerabilidad frente a eventos hidrometeorológicos ",null,null,null,null,null,null,null,null,null,null,null,null,null,null,null,null,null,null,null,null,null,null,null,null,null,null,null,null,null,null,null,null,null,null,null,null,null,null,null,null,null,null,null,null,null,null,null,null,null,null,"SANTA BARBARA"]
[null,null,null,null,null,null,null,null,null,null,null,null,null,null,1,3,1,1,4,"4.3.1.1.4 Realizar estudios para evaluar el impacto económico de desastres detonados por sismos, volcanes variabilidad y cambio climático anivel regional",null,null,null,null,null,null,null,null,null,null,null,null,null,null,null,null,null,null,null,null,null,null,null,null,null,null,null,null,null,null,null,null,null,null,null,null,null,null,null,null,null,null,null,null,null,null,null,null,null,null,"SANTA ROSA DE OSOS"]
[null,null,null,null,null,null,null,null,null,null,null,null,null,null,1,3,1,1,5,"4.3.1.1.5 Realizar estudios para analizar la vulnerabilidad fiscal del país ante fenómenos climáticos",null,null,null,null,null,null,null,null,null,null,null,null,null,null,null,null,null,null,null,null,null,null,null,null,null,null,null,null,null,null,null,null,null,null,null,null,null,null,null,null,null,null,null,null,null,null,null,null,null,null,"SANTAFE DE ANTIOQUIA"]
[null,null,null,null,null,null,null,null,null,null,null,null,null,null,1,3,1,2,1,"4.3.1.2.1 Elaboración de los estudios  de riesgo e municipios priorizados para su incorporación en los planes de ordenamiento territorial.",null,null,null,null,null,null,null,null,null,null,null,null,null,null,null,null,null,null,null,null,null,null,null,null,null,null,null,null,null,null,null,null,null,null,null,null,null,null,null,null,null,null,null,null,null,null,null,null,null,null,"SANTO DOMINGO"]
[null,null,null,null,null,null,null,null,null,null,null,null,null,null,1,3,1,2,2,"4.3.1.2.2 Definir lineamientos para el uso, análisis e interpretación de información técnica, asociada a fenómenos de origen natural y socio natural y tecnológico, para orientar la toma de decisiones de las entidades territoriales",null,null,null,null,null,null,null,null,null,null,null,null,null,null,null,null,null,null,null,null,null,null,null,null,null,null,null,null,null,null,null,null,null,null,null,null,null,null,null,null,null,null,null,null,null,null,null,null,null,null,"SEGOVIA"]
[null,null,null,null,null,null,null,null,null,null,null,null,null,null,1,3,1,2,3,"4.3.1.2.3 Diseñar la estrategia y el mecanismo institucional para el modelamiento de escenarios de riesgo",null,null,null,null,null,null,null,null,null,null,null,null,null,null,null,null,null,null,null,null,null,null,null,null,null,null,null,null,null,null,null,null,null,null,null,null,null,null,null,null,null,null,null,null,null,null,null,null,null,null,"SONSON"]
[null,null,null,null,null,null,null,null,null,null,null,null,null,null,1,3,1,3,1,"4.3.1.3.1 Diseñar e implementar un Sistema de Información de Cambio Climático a partir de la integración de plataformas de información existentes, para poner a disposición los indicadores y metas para hacer seguimiento a los compromisos en adaptación y sus medios de implementación, así como para monitorear y evaluar los avances nacionales y el cumplimiento de metas en materia de emisiones de GEI.",null,null,null,null,null,null,null,null,null,null,null,null,null,null,null,null,null,null,null,null,null,null,null,null,null,null,null,null,null,null,null,null,null,null,null,null,null,null,null,null,null,null,null,null,null,null,null,null,null,null,"SOPETRAN"]
[null,null,null,null,null,null,null,null,null,null,null,null,null,null,1,3,1,3,2,"4.3.1.3.2 Establecer un procedimiento para la definición de las metas nacionales de mediano y largo plazo en cambio climático y para el seguimiento y actualización periódica de las metas de la contribución nacionalmente determinada (NDC por sus siglas en inglés), acorde a los lineamientos de la Convención Marco de las Naciones Unidas sobre el Cambio Climático (CMNUCC), ",null,null,null,null,null,null,null,null,null,null,null,null,null,null,null,null,null,null,null,null,null,null,null,null,null,null,null,null,null,null,null,null,null,null,null,null,null,null,null,null,null,null,null,null,null,null,null,null,null,null,"TAMESIS"]
[null,null,null,null,null,null,null,null,null,null,null,null,null,null,1,3,2,1,1,"4.3.2.1.1 Diseñar e implementar una guía técnica para la incorporación de los análisis de riesgo de desastres para la formulación y viabilización de proyectos de inversión a financiar con recursos del Sistema General de Regalías.",null,null,null,null,null,null,null,null,null,null,null,null,null,null,null,null,null,null,null,null,null,null,null,null,null,null,null,null,null,null,null,null,null,null,null,null,null,null,null,null,null,null,null,null,null,null,null,null,null,null,"TARAZA"]
[null,null,null,null,null,null,null,null,null,null,null,null,null,null,1,3,2,1,2,"4.3.2.1.2 Implementar proyectos de reducción del riesgo, atendiendo los principios de subsidiariedad y complementariedad establecidos en la Ley 1523 de 2012",null,null,null,null,null,null,null,null,null,null,null,null,null,null,null,null,null,null,null,null,null,null,null,null,null,null,null,null,null,null,null,null,null,null,null,null,null,null,null,null,null,null,null,null,null,null,null,null,null,null,"TARSO"]
[null,null,null,null,null,null,null,null,null,null,null,null,null,null,1,3,2,1,3,"4.3.2.1.3 Fortalecer la reducción del riesgo de desastres por fenómenos de erosión costera en sectorescríticos del país, articulando esfuerzos técnicos, administrativos y financieros.",null,null,null,null,null,null,null,null,null,null,null,null,null,null,null,null,null,null,null,null,null,null,null,null,null,null,null,null,null,null,null,null,null,null,null,null,null,null,null,null,null,null,null,null,null,null,null,null,null,null,"TITIRIBI"]
[null,null,null,null,null,null,null,null,null,null,null,null,null,null,1,3,2,1,4,"4.3.2.1.4 Diseñar e implementar el Programa Nacional de Asistencia Técnica dirigido a entidades territoriales en gestión del riesgo de desastres y cambio climático, con criterios de focalización y complementariedad",null,null,null,null,null,null,null,null,null,null,null,null,null,null,null,null,null,null,null,null,null,null,null,null,null,null,null,null,null,null,null,null,null,null,null,null,null,null,null,null,null,null,null,null,null,null,null,null,null,null,"TOLEDO"]
[null,null,null,null,null,null,null,null,null,null,null,null,null,null,1,3,2,1,5,"4.3.2.1.5 Diseñar una estrategia nacional de fortalecimiento de comunidades en gestión del riesgo de desastres y adaptación al cambio climático, con enfoque diferencial",null,null,null,null,null,null,null,null,null,null,null,null,null,null,null,null,null,null,null,null,null,null,null,null,null,null,null,null,null,null,null,null,null,null,null,null,null,null,null,null,null,null,null,null,null,null,null,null,null,null,"TURBO"]
[null,null,null,null,null,null,null,null,null,null,null,null,null,null,1,3,2,2,1,"4.3.2.2.1 Formular instrumentos técnicos y regulatorios para promover la adaptación al cambio climático en proyectos de inversión ",null,null,null,null,null,null,null,null,null,null,null,null,null,null,null,null,null,null,null,null,null,null,null,null,null,null,null,null,null,null,null,null,null,null,null,null,null,null,null,null,null,null,null,null,null,null,null,null,null,null,"URAMITA"]
[null,null,null,null,null,null,null,null,null,null,null,null,null,null,1,3,2,2,2,"4.3.2.2.2 Orientar a los sectores y las autoridades ambientales regionales en la implementación de iniciativas de adaptación al cambio climático en territorios, comunidades o ecosistemas vulnerables,",null,null,null,null,null,null,null,null,null,null,null,null,null,null,null,null,null,null,null,null,null,null,null,null,null,null,null,null,null,null,null,null,null,null,null,null,null,null,null,null,null,null,null,null,null,null,null,null,null,null,"URRAO"]
[null,null,null,null,null,null,null,null,null,null,null,null,null,null,1,3,2,2,3,"4.3.2.2.3 Implementar iniciativas para la adaptación  al cambio climático en sistemas productivos agropecuarios, en asocio con los gremios, en asocio con los gremios y los centros de investigación, y con el apoyo de la cooperación internacional. Además, consolidará las mesas agroclimáticas a nivel nacional y regional para brindar orientaciones técnicas en materia de adaptación al cambio climático.",null,null,null,null,null,null,null,null,null,null,null,null,null,null,null,null,null,null,null,null,null,null,null,null,null,null,null,null,null,null,null,null,null,null,null,null,null,null,null,null,null,null,null,null,null,null,null,null,null,null,"VALDIVIA"]
[null,null,null,null,null,null,null,null,null,null,null,null,null,null,1,3,2,2,4,"4.3.2.2.4 Generar lineamientos técnicos para incluir análisis de riesgos climáticos y criterios de adaptación en el diseño y construcción de infraestructura de transporte, así como implementar un programa de mejoramiento para infraestructura vulnerable ante fenómenos asociados a la variabilidad climática.",null,null,null,null,null,null,null,null,null,null,null,null,null,null,null,null,null,null,null,null,null,null,null,null,null,null,null,null,null,null,null,null,null,null,null,null,null,null,null,null,null,null,null,null,null,null,null,null,null,null,"VALPARAISO"]
[null,null,null,null,null,null,null,null,null,null,null,null,null,null,1,3,2,2,5,"4.3.2.2.5 Promover el desarrollo de lineamientos técnicos para implementar mecanismos preventivos que impidan la generación de eventos asociados al riesgo tecnológico",null,null,null,null,null,null,null,null,null,null,null,null,null,null,null,null,null,null,null,null,null,null,null,null,null,null,null,null,null,null,null,null,null,null,null,null,null,null,null,null,null,null,null,null,null,null,null,null,null,null,"VEGACHI"]
[null,null,null,null,null,null,null,null,null,null,null,null,null,null,1,3,2,2,6,"4.3.2.2.6 Generar lineamientos técnicos para incluir análisis de riesgos climáticos y criterios de adaptación en el diseño, construcción y mejoramiento de edificaciones y entornos construidos y de infraestructura de saneamiento básico.",null,null,null,null,null,null,null,null,null,null,null,null,null,null,null,null,null,null,null,null,null,null,null,null,null,null,null,null,null,null,null,null,null,null,null,null,null,null,null,null,null,null,null,null,null,null,null,null,null,null,"VENECIA"]
[null,null,null,null,null,null,null,null,null,null,null,null,null,null,1,3,2,2,7,"4.3.2.2.7 Desarrollar lineamientos para el reasentamiento de población en zonas de alto riesgo no mitigable y la creación de programas de vigilancia, control del uso y ocupación del suelo a nivel municipal en zonas de alto riesgo",null,null,null,null,null,null,null,null,null,null,null,null,null,null,null,null,null,null,null,null,null,null,null,null,null,null,null,null,null,null,null,null,null,null,null,null,null,null,null,null,null,null,null,null,null,null,null,null,null,null,"VIGIA DEL FUERTE"]
[null,null,null,null,null,null,null,null,null,null,null,null,null,null,1,3,2,2,8,"4.3.2.2.8 Desarrollar un programa de asistencia técnica para que las empresas incorporen el riesgo climático en sus matrices de riesgo operacional y aprovechen las oportunidades de la variabilidad y el cambio climático",null,null,null,null,null,null,null,null,null,null,null,null,null,null,null,null,null,null,null,null,null,null,null,null,null,null,null,null,null,null,null,null,null,null,null,null,null,null,null,null,null,null,null,null,null,null,null,null,null,null,"YALI"]
[null,null,null,null,null,null,null,null,null,null,null,null,null,null,1,3,2,2,9,"4.3.2.2.9 Redefinir los mecanismos técnicos, financieros y operacionales del Fondo Adaptación para redimensionarlo como Fondo encargado de promover la adaptación y mitigación ante el cambio climático en el marco del sector de ambiente y desarrollo sostenible.",null,null,null,null,null,null,null,null,null,null,null,null,null,null,null,null,null,null,null,null,null,null,null,null,null,null,null,null,null,null,null,null,null,null,null,null,null,null,null,null,null,null,null,null,null,null,null,null,null,null,"YARUMAL"]
[null,null,null,null,null,null,null,null,null,null,null,null,null,null,1,3,2,2,10,"4.3.2.2.10 Diseñar una política pública para reducir las condiciones de riesgo ante eventos de variabilidad climática",null,null,null,null,null,null,null,null,null,null,null,null,null,null,null,null,null,null,null,null,null,null,null,null,null,null,null,null,null,null,null,null,null,null,null,null,null,null,null,null,null,null,null,null,null,null,null,null,null,null,"YOLOMBO"]
[null,null,null,null,null,null,null,null,null,null,null,null,null,null,1,3,3,1,1,"4.3.3.1.1 Realizar estudios  para valorar las necesidades del país en materia de adaptación y así cuantificar la brecha de financiación en adaptación.",null,null,null,null,null,null,null,null,null,null,null,null,null,null,null,null,null,null,null,null,null,null,null,null,null,null,null,null,null,null,null,null,null,null,null,null,null,null,null,null,null,null,null,null,null,null,null,null,null,null,"YONDO"]
[null,null,null,null,null,null,null,null,null,null,null,null,null,null,1,3,3,1,2,"4.3.3.1.2 Definir lineamientos para el diseño e implementación de líneas de crédito especiales que promuevan las inversiones bajas en carbono y resilientes al clima",null,null,null,null,null,null,null,null,null,null,null,null,null,null,null,null,null,null,null,null,null,null,null,null,null,null,null,null,null,null,null,null,null,null,null,null,null,null,null,null,null,null,null,null,null,null,null,null,null,null,"ZARAGOZA"]
[null,null,null,null,null,null,null,null,null,null,null,null,null,null,1,3,3,1,3,"4.3.3.1.3 Diseñar lineamientos para que entidades financieras orienten la incorporación de análisis de riesgo ambiental y social (ARAS) en la evaluación de sus productos de crédito.",null,null,null,null,null,null,null,null,null,null,null,null,null,null,null,null,null,null,null,null,null,null,null,null,null,null,null,null,null,null,null,null,null,null,null,null,null,null,null,null,null,null,null,null,null,null,null,null,null,null,"ARAUCA"]
[null,null,null,null,null,null,null,null,null,null,null,null,null,null,1,3,3,2,1,"4.3.3.2.1 Elaborar e implementar criterios para la priorización de proyectos financiados con recursos del Fondo Nacional para la Gestión del Riesgo de Desastres (FNGRD), analizando condiciones de amenaza y vulnerabilidad, pobreza y desigualdad, y capacidad de cofinanciación y promover la implementación de acciones estratégicas focalizadas que articulen acciones de gestión de riesgos y protección social.",null,null,null,null,null,null,null,null,null,null,null,null,null,null,null,null,null,null,null,null,null,null,null,null,null,null,null,null,null,null,null,null,null,null,null,null,null,null,null,null,null,null,null,null,null,null,null,null,null,null,"ARAUQUITA"]
[null,null,null,null,null,null,null,null,null,null,null,null,null,null,1,3,3,3,1,"4.3.3.3.1 Avanzar en la evaluación y estructuración de mecanismos de protección financiera, la formulación de esquemas y adquisición de contratos de aseguramiento y adelantar la estructuración de un insstrumento de protección financiera ante eventos hidrometeorólogicos",null,null,null,null,null,null,null,null,null,null,null,null,null,null,null,null,null,null,null,null,null,null,null,null,null,null,null,null,null,null,null,null,null,null,null,null,null,null,null,null,null,null,null,null,null,null,null,null,null,null,"CRAVO NORTE"]
[null,null,null,null,null,null,null,null,null,null,null,null,null,null,1,3,3,3,2,"4.3.3.3.2 Elaborar lineamientos para promover que las entidades del nivel territorial adopten estrategias de protección financiera ante la ocurrencia de eventos naturales",null,null,null,null,null,null,null,null,null,null,null,null,null,null,null,null,null,null,null,null,null,null,null,null,null,null,null,null,null,null,null,null,null,null,null,null,null,null,null,null,null,null,null,null,null,null,null,null,null,null,"FORTUL"]
[null,null,null,null,null,null,null,null,null,null,null,null,null,null,1,3,3,3,3,"4.3.3.3.3 Diseñar guías técnicas para promover protección financiera ante desastres en los sectores de agricultura, transporte, energía, agua y saneamiento básico, y generar inventarios de bienes fiscales y bases de datos de pólizas de seguros por parte de los sectores,",null,null,null,null,null,null,null,null,null,null,null,null,null,null,null,null,null,null,null,null,null,null,null,null,null,null,null,null,null,null,null,null,null,null,null,null,null,null,null,null,null,null,null,null,null,null,null,null,null,null,"PUERTO RONDON"]
[null,null,null,null,null,null,null,null,null,null,null,null,null,null,1,3,4,1,1,"4.3.4.1.1 Diseñar protocolos de actuación para la respuesta a diferentes tipos de desastre, en el marco de la Estrategia Nacional para la Respuesta a Emergencias (UNGRD, 2015). Así mismo, las entidades nacionales y territoriales fortalecerán sus capacidades de preparación y de respuesta frente a desastres, y sus mecanismos de coordinación.",null,null,null,null,null,null,null,null,null,null,null,null,null,null,null,null,null,null,null,null,null,null,null,null,null,null,null,null,null,null,null,null,null,null,null,null,null,null,null,null,null,null,null,null,null,null,null,null,null,null,"SARAVENA"]
[null,null,null,null,null,null,null,null,null,null,null,null,null,null,1,3,4,1,2,"4.3.4.1.2 Robustecer la actuación y capacidades de la Fuerza Pública y la Defensa Civil Colombiana en la atención de emergencias y desastres asociados a fenómenos naturales y antrópicos, además de ayuda humanitaria, a fin de garantizar una mejor articulación con el SNGRD y la UNGRD.",null,null,null,null,null,null,null,null,null,null,null,null,null,null,null,null,null,null,null,null,null,null,null,null,null,null,null,null,null,null,null,null,null,null,null,null,null,null,null,null,null,null,null,null,null,null,null,null,null,null,"TAME"]
[null,null,null,null,null,null,null,null,null,null,null,null,null,null,1,3,4,1,3,"4.3.4.1.3 fortalecerá la gestión del riesgo de desastres y la prestación del servicio público esencial de bomberos en Colombia.\n",null,null,null,null,null,null,null,null,null,null,null,null,null,null,null,null,null,null,null,null,null,null,null,null,null,null,null,null,null,null,null,null,null,null,null,null,null,null,null,null,null,null,null,null,null,null,null,null,null,null,"BARANOA"]
[null,null,null,null,null,null,null,null,null,null,null,null,null,null,1,3,4,1,4,"4.3.4.1.4 Diseñar una metodología de evaluación de daños, pérdidas y necesidades post desastre",null,null,null,null,null,null,null,null,null,null,null,null,null,null,null,null,null,null,null,null,null,null,null,null,null,null,null,null,null,null,null,null,null,null,null,null,null,null,null,null,null,null,null,null,null,null,null,null,null,null,"BARRANQUILLA"]
[null,null,null,null,null,null,null,null,null,null,null,null,null,null,1,3,4,2,1,"4.3.4.2.1 Formular una Estrategia de Recuperación Resiliente ante Desastres y Adaptada al Cambio Climático, definiendo instrumentos de coordinación, roles y responsabilidades en el manejo de la emergencia y la recuperación y mecanismos de gestión de recursos, según la magnitud y el alcance del desastre,",null,null,null,null,null,null,null,null,null,null,null,null,null,null,null,null,null,null,null,null,null,null,null,null,null,null,null,null,null,null,null,null,null,null,null,null,null,null,null,null,null,null,null,null,null,null,null,null,null,null,"CAMPO DE LA CRUZ"]
[null,null,null,null,null,null,null,null,null,null,null,null,null,null,1,3,4,3,1,"4.3.4.3.1 Finalizar y evaluar las intervenciones que adelantó en las zonas afectadas por La Niña de 2010-2011 y, en coordinación con la UNGRD, en el marco del SNGRD, definirá roles y responsabilidades de las entidades que deben asumir la operación, mantenimiento y vigilancia de obras de infraestructura entregadas, con el fin de garantizar su sostenibilidad.",null,null,null,null,null,null,null,null,null,null,null,null,null,null,null,null,null,null,null,null,null,null,null,null,null,null,null,null,null,null,null,null,null,null,null,null,null,null,null,null,null,null,null,null,null,null,null,null,null,null,"CANDELARIA"]
[null,null,null,null,null,null,null,null,null,null,null,null,null,null,1,3,4,3,2,"4.3.4.3.2 Coordinar y terminar las intervenciones de reconstrucción y planificación territorial correspondientes al Plan Construyendo Mocoa, buscando no reconfigurar escenarios de riesgo; todo elllo con la supervisión de la Vicepresidencia de la República, participación de entidades nacionales  y el muinicipio.",null,null,null,null,null,null,null,null,null,null,null,null,null,null,null,null,null,null,null,null,null,null,null,null,null,null,null,null,null,null,null,null,null,null,null,null,null,null,null,null,null,null,null,null,null,null,null,null,null,null,"GALAPA"]
[null,null,null,null,null,null,null,null,null,null,null,null,null,null,1,4,1,1,1,"4.4.1.1.1 Presentar un proyecto de ley para reformar las CAR, y crear mecanismos de modernización institucional del SINA, con particular atención a la ANLA y al IDEAM, que fortalezcan la generación de información",null,null,null,null,null,null,null,null,null,null,null,null,null,null,null,null,null,null,null,null,null,null,null,null,null,null,null,null,null,null,null,null,null,null,null,null,null,null,null,null,null,null,null,null,null,null,null,null,null,null,"JUAN DE ACOSTA"]
[null,null,null,null,null,null,null,null,null,null,null,null,null,null,1,4,1,1,2,"4.4.1.1.2 Evaluar los instrumentos de financiamiento del sector ambiental para identificar nuevas fuentes y mejorar la distribución de las existentes al interior del Sina, con criterios de equidad y efectividad. Para esto, hará los ajustes normativos y administrativos que se requieran, en línea con las recomendaciones de la OCDE sobre gasto público ambiental. Así mismo, establecerá con el apoyo del DNP, criterios e indicadores de inversión que faciliten su seguimiento. Especial atención se brindará al fortalecimiento del Fondo de Compensación Ambiental (FCA) y del Fondo Nacional Ambiental (FONAM), que permita asignar mayor presupuesto para las CAR.",null,null,null,null,null,null,null,null,null,null,null,null,null,null,null,null,null,null,null,null,null,null,null,null,null,null,null,null,null,null,null,null,null,null,null,null,null,null,null,null,null,null,null,null,null,null,null,null,null,null,"LURUACO"]
[null,null,null,null,null,null,null,null,null,null,null,null,null,null,1,4,1,1,3,"4.4.1.1.3 Evaluar el impacto y eficiencia de los incentivos fiscales asociados a la protección ambiental y promover el ajuste de aquellos que resultan ineficaces, poco eficientes o contradictorios.",null,null,null,null,null,null,null,null,null,null,null,null,null,null,null,null,null,null,null,null,null,null,null,null,null,null,null,null,null,null,null,null,null,null,null,null,null,null,null,null,null,null,null,null,null,null,null,null,null,null,"MALAMBO"]
[null,null,null,null,null,null,null,null,null,null,null,null,null,null,1,4,1,1,4,"4.4.1.1.4 Promover en las CAR procesos de transparencia, eficacia y publicidad en el uso de los recursos financieros, técnicos y administrativos.",null,null,null,null,null,null,null,null,null,null,null,null,null,null,null,null,null,null,null,null,null,null,null,null,null,null,null,null,null,null,null,null,null,null,null,null,null,null,null,null,null,null,null,null,null,null,null,null,null,null,"MANATI"]
[null,null,null,null,null,null,null,null,null,null,null,null,null,null,1,4,1,1,5,"4.4.1.1.5 Reforzar el régimen sancionatorio, ampliación de multas y comparendos ambientales cuyo destino será el fortalecimiento financiero y técnico de las autoridades ambientales.",null,null,null,null,null,null,null,null,null,null,null,null,null,null,null,null,null,null,null,null,null,null,null,null,null,null,null,null,null,null,null,null,null,null,null,null,null,null,null,null,null,null,null,null,null,null,null,null,null,null,"PALMAR DE VARELA"]
[null,null,null,null,null,null,null,null,null,null,null,null,null,null,1,4,1,2,1,"4.4.1.2.1 Liderar el desarrollo de una Misión sobre Licenciamiento Ambiental que resulte en recomendaciones estratégicas para mejorar la efectividad de este instrumento y desarrollar con el apoyo de los Institutos de Investigación del SINA, un Índice de Efectividad de Licenciamiento Ambiental en línea con las recomendaciones de la OCDE, que se reportará de manera periódica.",null,null,null,null,null,null,null,null,null,null,null,null,null,null,null,null,null,null,null,null,null,null,null,null,null,null,null,null,null,null,null,null,null,null,null,null,null,null,null,null,null,null,null,null,null,null,null,null,null,null,"PIOJO"]
[null,null,null,null,null,null,null,null,null,null,null,null,null,null,1,4,1,2,2,"4.4.1.2.2 Mejorar la efectividad del proceso de licenciamiento ambiental y la evaluación de permisos y otros instrumentos de control ambiental, a partir de la coordinación entre las autoridades ambientales y los institutos de investigación del Sina. Y busca evaluar y realizar, en coordinación con el ANLA los ajustes institucionales para fortalecer el proceso de licenciamiento ambiental y los diferentes trámites y permisos que evalúa la entidad.",null,null,null,null,null,null,null,null,null,null,null,null,null,null,null,null,null,null,null,null,null,null,null,null,null,null,null,null,null,null,null,null,null,null,null,null,null,null,null,null,null,null,null,null,null,null,null,null,null,null,"POLONUEVO"]
[null,null,null,null,null,null,null,null,null,null,null,null,null,null,1,4,1,2,3,"4.4.1.2.3 Simplificar  y agilizar los tramites ante el ANLA y Minambiente, especialmente aquellos necesarios para obtener los beneficios tributarios por inversiones ambientales",null,null,null,null,null,null,null,null,null,null,null,null,null,null,null,null,null,null,null,null,null,null,null,null,null,null,null,null,null,null,null,null,null,null,null,null,null,null,null,null,null,null,null,null,null,null,null,null,null,null,"PONEDERA"]
[null,null,null,null,null,null,null,null,null,null,null,null,null,null,1,4,2,1,1,"4.4.2.1.1 Establecer Agendas Estratégicas Intersectoriales como un mecanismo de diálogo y trabajo conjunto permanente entre el sector ambiental y los otros sectores productivos que fortalezcan la regulación ambiental y la transformación de estos sectores en el marco del crecimiento verde, que faciliten la gestión del riesgo y del cambio climático, y que permitan hacer seguimiento a las metas establecidas en el Plan Nacional de Desarrollo.",null,null,null,null,null,null,null,null,null,null,null,null,null,null,null,null,null,null,null,null,null,null,null,null,null,null,null,null,null,null,null,null,null,null,null,null,null,null,null,null,null,null,null,null,null,null,null,null,null,null,"PUERTO COLOMBIA"]
[null,null,null,null,null,null,null,null,null,null,null,null,null,null,1,4,2,1,2,"4.4.2.1.2 Coordinar la implementación de las acciones y medidas para la NDC como se  y poner en marcha una Estrategia de Racionalización y Armonización de políticas, normas, instrumentos de planificación y ordenamiento territorial y sus arreglos institucionales y finalmente estudiar los instrumentos de política ambiental que deberán estar sujetos a un análisis de impacto normativo.",null,null,null,null,null,null,null,null,null,null,null,null,null,null,null,null,null,null,null,null,null,null,null,null,null,null,null,null,null,null,null,null,null,null,null,null,null,null,null,null,null,null,null,null,null,null,null,null,null,null,"REPELON"]
[null,null,null,null,null,null,null,null,null,null,null,null,null,null,1,4,2,2,1,"4.4.2.2.1 Realizar una misión para la modernización de la gestión integral del agua y sus mecanismos institucionales desde la perspectiva de la oferta y  la demanda y optimizar los instrumentos de ordenación y manejo de cuencas hidrográficas para asegurar una gestión integrada del recurso hídrico. ",null,null,null,null,null,null,null,null,null,null,null,null,null,null,null,null,null,null,null,null,null,null,null,null,null,null,null,null,null,null,null,null,null,null,null,null,null,null,null,null,null,null,null,null,null,null,null,null,null,null,"SABANAGRANDE"]
[null,null,null,null,null,null,null,null,null,null,null,null,null,null,1,4,2,2,2,"4.4.2.2.2 Crear la Unidad de Planificación de Residuos Sólidos para una economía circular,",null,null,null,null,null,null,null,null,null,null,null,null,null,null,null,null,null,null,null,null,null,null,null,null,null,null,null,null,null,null,null,null,null,null,null,null,null,null,null,null,null,null,null,null,null,null,null,null,null,null,"SABANALARGA"]
[null,null,null,null,null,null,null,null,null,null,null,null,null,null,1,4,2,2,3,"4.4.2.2.3 Fortalecer la capacidad financiera, técnica, tecnológica y administrativa de los institutos de investigación ambiental, articulados en el Sina",null,null,null,null,null,null,null,null,null,null,null,null,null,null,null,null,null,null,null,null,null,null,null,null,null,null,null,null,null,null,null,null,null,null,null,null,null,null,null,null,null,null,null,null,null,null,null,null,null,null,"SANTA LUCIA"]
[null,null,null,null,null,null,null,null,null,null,null,null,null,null,1,4,2,2,4,"4.4.2.2.4 Integrar la agenda de la Política de Crecimiento Verde en el Sistema Nacional de Competitividad, Ciencia, Tecnología e Innovación (SNCCTI), y poner en marcha la Comisión Interinstitucional de Bioeconomía, que formule y oriente la implementación de una estrategia nacional para el desarrollo de proyectos de la bioprospección con un componente de regionalización a través del SNCCTI.",null,null,null,null,null,null,null,null,null,null,null,null,null,null,null,null,null,null,null,null,null,null,null,null,null,null,null,null,null,null,null,null,null,null,null,null,null,null,null,null,null,null,null,null,null,null,null,null,null,null,"SANTO TOMAS"]
[null,null,null,null,null,null,null,null,null,null,null,null,null,null,1,4,2,2,5,"4.4.2.2.5 Diseñar y poner en marcha los ajustes institucionales que se requieran para el desarrollo de la economía forestal con una visión que integre el aprovechamiento sostenible de los bosques naturales y las plantaciones comerciales.",null,null,null,null,null,null,null,null,null,null,null,null,null,null,null,null,null,null,null,null,null,null,null,null,null,null,null,null,null,null,null,null,null,null,null,null,null,null,null,null,null,null,null,null,null,null,null,null,null,null,"SOLEDAD"]
[null,null,null,null,null,null,null,null,null,null,null,null,null,null,1,4,3,1,1,"4.4.3.1.1 Implementar una estrategia de comunicación efectiva, que incorpore acciones de economía naranja y educación ambiental \nRealizar campañas que fortalezcan la cultura ambiental a nivel empresarial y familiar, con siembras anuales y jornadas de participación en la protección y limpieza del entorno natural y garantizar el acceso efectivo a la información ambiental y la producción de material asociado a la problemática para todos los públicos para su distribución en medios masivos, con enfoque diferencial para comunidades locales urbanas y rurales, con el fin de incrementar la valoración social de la naturaleza.",null,null,null,null,null,null,null,null,null,null,null,null,null,null,null,null,null,null,null,null,null,null,null,null,null,null,null,null,null,null,null,null,null,null,null,null,null,null,null,null,null,null,null,null,null,null,null,null,null,null,"SUAN"]
[null,null,null,null,null,null,null,null,null,null,null,null,null,null,1,4,3,1,2,"4.4.3.1.2 Mantener agendas de diálogo y trabajo conjunto permanente entre los sectores productivos y el sector ambiental, que fortalezcan la regulación ambiental y la transformación de estos sectores en el marco del crecimiento verde.",null,null,null,null,null,null,null,null,null,null,null,null,null,null,null,null,null,null,null,null,null,null,null,null,null,null,null,null,null,null,null,null,null,null,null,null,null,null,null,null,null,null,null,null,null,null,null,null,null,null,"TUBARA"]
[null,null,null,null,null,null,null,null,null,null,null,null,null,null,1,4,3,1,3,"4.4.3.1.3 Desarrollar esquemas de gobernanza innovadores para el manejo de las áreas protegidas y fortalecer las redes de la sociedad civil que impulsen la conservación y el uso sostenible del territorio y la biodiversidad con especial énfasis en las organizaciones articuladoras de reservas naturales de la sociedad civil.",null,null,null,null,null,null,null,null,null,null,null,null,null,null,null,null,null,null,null,null,null,null,null,null,null,null,null,null,null,null,null,null,null,null,null,null,null,null,null,null,null,null,null,null,null,null,null,null,null,null,"USIACURI"]
[null,null,null,null,null,null,null,null,null,null,null,null,null,null,1,4,3,1,4,"4.4.3.1.4 formularán la Política Nacional de Protección y Bienestar de Animales Domésticos y Silvestres: \"Un país amigable con los Animales\" que incorpore estrategias y programas que promuevan la tenencia responsable, la esterilización, el manejo de animales abandonados y maltratados, la asistencia integral y la prevención del maltrato, con el fin de erradicar en el país toda forma de violencia, crueldad, tráfico y comercio ilegal.",null,null,null,null,null,null,null,null,null,null,null,null,null,null,null,null,null,null,null,null,null,null,null,null,null,null,null,null,null,null,null,null,null,null,null,null,null,null,null,null,null,null,null,null,null,null,null,null,null,null,"BOGOTA, D.C."]
[null,null,null,null,null,null,null,null,null,null,null,null,null,null,1,4,2,1,1,"4.4.2.1.1 Promover y fortalecer las audiencias públicas y las veedurías ambientales en la gestión de las CARS. Adicionalmente, fortalecerá la sociedad civil colombiana como agente que previene y maneja los conflictos ambientales.",null,null,null,null,null,null,null,null,null,null,null,null,null,null,null,null,null,null,null,null,null,null,null,null,null,null,null,null,null,null,null,null,null,null,null,null,null,null,null,null,null,null,null,null,null,null,null,null,null,null,"ACHI"]
[null,null,null,null,null,null,null,null,null,null,null,null,null,null,1,4,3,1,1,"4.4.3.1.1 Consolidar cinco centros regionales de diálogo ambiental como instancias de facilitación, articulación, participación, cooperación y reflexión para la identificación, priorización y discusión de los conflictos socioambientales a nivel regional, al tiempo que fortalecerá los espacios de diálogo existentes .",null,null,null,null,null,null,null,null,null,null,null,null,null,null,null,null,null,null,null,null,null,null,null,null,null,null,null,null,null,null,null,null,null,null,null,null,null,null,null,null,null,null,null,null,null,null,null,null,null,null,"ALTOS DEL ROSARIO"]
[null,null,null,null,null,null,null,null,null,null,null,null,null,null,1,4,3,1,2,"4.4.3.1.2 Estructurar una propuesta de especialización de tribunales judiciales y jueces en temas ambientales, para aumentar su idoneidad y capacidad técnica para la prevención y resolución de conflictos socioambientales y económicos, acompañada de un programa de capacitación a funcionarios judiciales en derecho ambiental.",null,null,null,null,null,null,null,null,null,null,null,null,null,null,null,null,null,null,null,null,null,null,null,null,null,null,null,null,null,null,null,null,null,null,null,null,null,null,null,null,null,null,null,null,null,null,null,null,null,null,"ARENAL"]
[null,null,null,null,null,null,null,null,null,null,null,null,null,null,1,4,3,1,3,"4.4.3.1.3 Fortalecer las instancias de diálogo y el trabajo conjunto con las autoridades indígenas, las comunidades negras y la población campesina como aliados estratégicos para la conservación y la gestión ambiental en los territorios, sobre todo en las problemáticas de uso, ocupación y tenencia de las regiones.",null,null,null,null,null,null,null,null,null,null,null,null,null,null,null,null,null,null,null,null,null,null,null,null,null,null,null,null,null,null,null,null,null,null,null,null,null,null,null,null,null,null,null,null,null,null,null,null,null,null,"ARJONA"]
[null,null,null,null,null,null,null,null,null,null,null,null,null,null,1,4,3,2,1,"4.4.3.2.1 Crear la Comisión intersectorial para los asuntos judiciales, relacionada con la extracción de minerales, la deforestación y la degradación ambiental.",null,null,null,null,null,null,null,null,null,null,null,null,null,null,null,null,null,null,null,null,null,null,null,null,null,null,null,null,null,null,null,null,null,null,null,null,null,null,null,null,null,null,null,null,null,null,null,null,null,null,"ARROYOHONDO"]
[null,null,null,null,null,null,null,null,null,null,null,null,null,null,1,4,3,2,2,"4.4.3.2.2 Destinar los recursos para el cumplimiento de órdenes judiciales relacionadas con la extracción de minerales, la deforestación y la degradación ambiental.",null,null,null,null,null,null,null,null,null,null,null,null,null,null,null,null,null,null,null,null,null,null,null,null,null,null,null,null,null,null,null,null,null,null,null,null,null,null,null,null,null,null,null,null,null,null,null,null,null,null,"BARRANCO DE LOBA"]
[null,null,null,null,null,null,null,null,null,null,null,null,null,null,1,4,4,1,1,"4.4.4.1.1 Fortalecer el SIAC, a través de la actualización de los lineamientos de política de información ambiental y el protocolo para la gestión de datos e información.\nDesarrollar e implementar el Sistema de Información de Planificación y Gestión Ambiental de las CAR,  \nGarantizar el fácil acceso de los sectores, territorios y sociedad civil al SIAC, que articule sub-Subsistemas temáticos con los de las CARS, (incluyendo la Ventanilla Única de Trámites Ambientales, VITAL) y facilitar la interoperabilidad y la recolección de datos e información para la generación y reporte de indicadores ambientales y mecanismos financieros.",null,null,null,null,null,null,null,null,null,null,null,null,null,null,null,null,null,null,null,null,null,null,null,null,null,null,null,null,null,null,null,null,null,null,null,null,null,null,null,null,null,null,null,null,null,null,null,null,null,null,"CALAMAR"]
[null,null,null,null,null,null,null,null,null,null,null,null,null,null,1,4,4,1,2,"4.4.4.1.2 Fortalecer la interoperabilidad y la recolección de datos e información para la generación y reporte de indicadores de estado, presión y respuesta, que expliquen los cambios en la calidad y el uso de los recursos naturales, mediante mecanismos de articulación con los sectores y territorios.",null,null,null,null,null,null,null,null,null,null,null,null,null,null,null,null,null,null,null,null,null,null,null,null,null,null,null,null,null,null,null,null,null,null,null,null,null,null,null,null,null,null,null,null,null,null,null,null,null,null,"CANTAGALLO"]
[null,null,null,null,null,null,null,null,null,null,null,null,null,null,1,4,4,1,3,"4.4.4.1.3 Implementar el apoyo de los sectores los protocolos de transferencia de información y las mejoras tecnológicas necesarias para integrar los sistemas de información sectorial con el SIAC.",null,null,null,null,null,null,null,null,null,null,null,null,null,null,null,null,null,null,null,null,null,null,null,null,null,null,null,null,null,null,null,null,null,null,null,null,null,null,null,null,null,null,null,null,null,null,null,null,null,null,"CARTAGENA"]
[null,null,null,null,null,null,null,null,null,null,null,null,null,null,1,4,4,1,4,"4.4.4.1.4 Fortalecer la generación de información para la toma de decisiones, para lo cual, deberán diseñar e implementar estrategias que faciliten la prestación y venta de servicios, que permitandiversificar sus ingresos y mejorar su capacidad administrativa, financiera y técnica. Especial énfasis tendrá el IDEAM.",null,null,null,null,null,null,null,null,null,null,null,null,null,null,null,null,null,null,null,null,null,null,null,null,null,null,null,null,null,null,null,null,null,null,null,null,null,null,null,null,null,null,null,null,null,null,null,null,null,null,"CICUCO"]
[null,null,null,null,null,null,null,null,null,null,null,null,null,null,1,4,4,2,1,"4.4.4.2.1 Integrar, los sistemas de información forestal, para garantizar su interoperabilidad\nConsolidar un sistema nacional de información, monitoreo y reporte sobre restauración,el cual se articulará con el Sistema Nacional de Información Forestal (SNIF) y demás sistemas de información existentes.\nFortalecer la capacidad del Sistema de Monitoreo de Bosques y Carbono, para avanzar en el seguimiento a la deforestación en tiempo real.",null,null,null,null,null,null,null,null,null,null,null,null,null,null,null,null,null,null,null,null,null,null,null,null,null,null,null,null,null,null,null,null,null,null,null,null,null,null,null,null,null,null,null,null,null,null,null,null,null,null,"CLEMENCIA"]
[null,null,null,null,null,null,null,null,null,null,null,null,null,null,1,4,4,2,2,"4.4.4.2.2 Establecer las bases para el diseño e implementación de un sistema de información para la gestión integral de residuos sólidos.",null,null,null,null,null,null,null,null,null,null,null,null,null,null,null,null,null,null,null,null,null,null,null,null,null,null,null,null,null,null,null,null,null,null,null,null,null,null,null,null,null,null,null,null,null,null,null,null,null,null,"CORDOBA"]
[null,null,null,null,null,null,null,null,null,null,null,null,null,null,1,4,4,2,3,"4.4.4.2.3 Consolidar la cuenta satélite ambiental y formular el marco conceptual y la metodología para las cuentas satélites en bioeconomía y flujo de materiales. \nLiderar, en coordinación con MinTrabajo, la formulación de un marco conceptual para la medición de empleos verdes.",null,null,null,null,null,null,null,null,null,null,null,null,null,null,null,null,null,null,null,null,null,null,null,null,null,null,null,null,null,null,null,null,null,null,null,null,null,null,null,null,null,null,null,null,null,null,null,null,null,null,"EL CARMEN DE BOLIVAR"]
[null,null,null,null,null,null,null,null,null,null,null,null,null,null,1,4,4,2,4,"4.4.4.2.4 Elaborar un índice de desempeño del crecimiento verde a nivel territorial, a través del cual se identifiquen las oportunidades regionales para avanzar hacia la agenda de sostenibilidad del país.",null,null,null,null,null,null,null,null,null,null,null,null,null,null,null,null,null,null,null,null,null,null,null,null,null,null,null,null,null,null,null,null,null,null,null,null,null,null,null,null,null,null,null,null,null,null,null,null,null,null,"EL GUAMO"]
[null,null,null,null,null,null,null,null,null,null,null,null,null,null,1,4,4,2,5,"4.4.4.2.5 Implementar programas regionales y sectoriales de investigación y desarrollo de capacidades para generar y ajustar la información necesaria para monitorear y reportar el estado, tendencias y escenarios de la base natural de Colombia.",null,null,null,null,null,null,null,null,null,null,null,null,null,null,null,null,null,null,null,null,null,null,null,null,null,null,null,null,null,null,null,null,null,null,null,null,null,null,null,null,null,null,null,null,null,null,null,null,null,null,"EL PEÑON"]
[null,null,null,null,null,null,null,null,null,null,null,null,null,null,1,4,4,3,1,"4.4.4.3.1 Definir los mecanismos para un fácil acceso de los sectores, territorios y la sociedad civil a la información sobre la gestión y estado de los recursos naturales, los avances en la política de crecimiento verde, la gestión de riesgo de desastres y el cambio climático.",null,null,null,null,null,null,null,null,null,null,null,null,null,null,null,null,null,null,null,null,null,null,null,null,null,null,null,null,null,null,null,null,null,null,null,null,null,null,null,null,null,null,null,null,null,null,null,null,null,null,"HATILLO DE LOBA"]
[null,null,null,null,null,null,null,null,null,null,null,null,null,null,1,4,4,3,2,"4.4.4.3.2 Implementar un programa para desarrollar capacidades que permita la integración de la información sectorial para la generación del inventario de emisiones de GEI, en el marco del Sistema de Información de Cambio Climático y el Sistema Nacional de Inventarios de Gases de Efecto Invernadero (SINGEI) ",null,null,null,null,null,null,null,null,null,null,null,null,null,null,null,null,null,null,null,null,null,null,null,null,null,null,null,null,null,null,null,null,null,null,null,null,null,null,null,null,null,null,null,null,null,null,null,null,null,null,"MAGANGUE"]
[null,null,null,null,null,null,null,null,null,null,null,null,null,null,2,1,1,1,1,"15.1.1.1.1 Cada cabeza de sector será responsable de adelantar en su fuero, la identificación de duplicidades y traslape de funciones entre sus entidades, y deberá proponer los planes de acción para el ajuste en los casos en los que sea necesario.",null,null,null,null,null,null,null,null,null,null,null,null,null,null,null,null,null,null,null,null,null,null,null,null,null,null,null,null,null,null,null,null,null,null,null,null,null,null,null,null,null,null,null,null,null,null,null,null,null,null,"MAHATES"]
[null,null,null,null,null,null,null,null,null,null,null,null,null,null,2,1,2,1,1,"15.1.2.1.1 El DAFP consolidará el Modelo Integrado de Planeación y Gestión en las entidades públicas del orden nacional y territorial, y diseñará un esquema de asesoría técnica integral de acompañamiento por parte de las entidades líderes de las políticas de gestión y desempeño.",null,null,null,null,null,null,null,null,null,null,null,null,null,null,null,null,null,null,null,null,null,null,null,null,null,null,null,null,null,null,null,null,null,null,null,null,null,null,null,null,null,null,null,null,null,null,null,null,null,null,"MARGARITA"]
[null,null,null,null,null,null,null,null,null,null,null,null,null,null,2,1,3,1,1,"15.1.3.1.1 Las entidades del Gobierno nacional deberán proponer y desarrollar programas para mejorar las condiciones de la vida laboral de sus servidores, de manera que fomenten su desarrollo personal y profesional. Función Pública desarrollará un programa nacional de bienestar para los servidores públicos a través de estrategias como teletrabajo, bilingüismo, horarios flexibles en la jornada laboral, voluntariado y otros que incentiven el bienestar y la productividad de los servidores públicos, de modo que se impacte en la eficiencia y la gestión y se beneficie a los servidores en términos de ahorro de tiempo en el de desplazamiento y, en general, se les posibilite una mejor calidad de vida.",null,null,null,null,null,null,null,null,null,null,null,null,null,null,null,null,null,null,null,null,null,null,null,null,null,null,null,null,null,null,null,null,null,null,null,null,null,null,null,null,null,null,null,null,null,null,null,null,null,null,"MARIA LA BAJA"]
[null,null,null,null,null,null,null,null,null,null,null,null,null,null,2,1,4,1,1,"15.1.4.1.1 No Aplica",null,null,null,null,null,null,null,null,null,null,null,null,null,null,null,null,null,null,null,null,null,null,null,null,null,null,null,null,null,null,null,null,null,null,null,null,null,null,null,null,null,null,null,null,null,null,null,null,null,null,"MOMPOS"]
[null,null,null,null,null,null,null,null,null,null,null,null,null,null,2,2,1,1,1,"15.2.1.1.1 Fortalecer el diseño, seguimiento y evaluación de políticas públicas presentadas en este Plan Nacional de Desarrollo en el componente de sostenibilidad financiera, al aplicar como principios la eficiencia y la efectividad en el uso de los recursos públicos, en otras palabras, alcanzar los objetivos de la política al mínimo costo. Para conseguirlo, cada política debe tener asociada los costos en los que incurrió y especificar objetos de gasto y contar con un resultado medible que evidencie el éxito en la ejecución.",null,null,null,null,null,null,null,null,null,null,null,null,null,null,null,null,null,null,null,null,null,null,null,null,null,null,null,null,null,null,null,null,null,null,null,null,null,null,null,null,null,null,null,null,null,null,null,null,null,null,"MONTECRISTO"]
[null,null,null,null,null,null,null,null,null,null,null,null,null,null,2,2,2,1,1,"15.2.2.1.1 Colombia Compra Eficiente deberá moverse hacia un sistema de compras sostenible, mediante la incorporación de criterios de sostenibilidad social y ambiental en los acuerdos marco.",null,null,null,null,null,null,null,null,null,null,null,null,null,null,null,null,null,null,null,null,null,null,null,null,null,null,null,null,null,null,null,null,null,null,null,null,null,null,null,null,null,null,null,null,null,null,null,null,null,null,"MORALES"]
[null,null,null,null,null,null,null,null,null,null,null,null,null,null,2,2,3,1,1,"15.2.3.1.1 No Aplica",null,null,null,null,null,null,null,null,null,null,null,null,null,null,null,null,null,null,null,null,null,null,null,null,null,null,null,null,null,null,null,null,null,null,null,null,null,null,null,null,null,null,null,null,null,null,null,null,null,null,"NOROSI"]
[null,null,null,null,null,null,null,null,null,null,null,null,null,null,3,1,1,1,1,"1.1.1.1.1 La Vicepresidencia, la Secretaría de Transparencia, el DNP y el DAFP, con el acompañamiento de los Organismos de Control, liderarán la construcción de una matriz de riesgo de la corrupción en Colombia que recoja, por sector y por territorios, los riesgos más comunes, su calificación de severidad e impacto del riesgo, sus causas y manifestaciones. A partir de ella, deben definirse acciones de prevención y mitigación con sus respectivos responsables en las cabezas de los sectores y los gobiernos subnacionales, tiempos de ejecución, productos y metas.",{"$error":"#REF!"},null,null,null,null,null,null,null,null,null,null,null,null,null,null,null,null,null,null,null,null,null,null,null,null,null,null,null,null,null,null,null,null,null,null,null,null,null,null,null,null,null,null,null,null,null,null,null,null,null,"PINILLOS"]
[null,null,null,null,null,null,null,null,null,null,null,null,null,null,3,1,1,1,2,"1.1.1.1.2 El DAFP diseñará un sistema de selección meritocrática, evaluación del desempeño, formación y capacitación de jefes de OCI para asegurar la competencia y experiencia técnica anticorrupción en las entidades públicas del orden nacional y territorial.",{"$error":"#REF!"},null,null,null,null,null,null,null,null,null,null,null,null,null,null,null,null,null,null,null,null,null,null,null,null,null,null,null,null,null,null,null,null,null,null,null,null,null,null,null,null,null,null,null,null,null,null,null,null,null,"REGIDOR"]
[null,null,null,null,null,null,null,null,null,null,null,null,null,null,3,1,1,1,3,"1.1.1.1.3 El DAFP definirá directrices de auditoría para la detección de fraude y corrupción, con el fin de mejorar las capacidades de auditoría en la detección de fraudes (por parte de las OCI), la administración de riesgos (por parte de las oficinas de planeación y los equipos directivos de las entidades), la adopción de un modelo de auditorías compartidas en sectores de alto riesgo y la implementación de comités de auditorías en las empresas estatales.",{"$error":"#REF!"},null,null,null,null,null,null,null,null,null,null,null,null,null,null,null,null,null,null,null,null,null,null,null,null,null,null,null,null,null,null,null,null,null,null,null,null,null,null,null,null,null,null,null,null,null,null,null,null,null,"RIO VIEJO"]
[null,null,null,null,null,null,null,null,null,null,null,null,null,null,3,2,1,1,1,"1.2.1.1.1 No Aplica",null,null,null,null,null,null,null,null,null,null,null,null,null,null,null,null,null,null,null,null,null,null,null,null,null,null,null,null,null,null,null,null,null,null,null,null,null,null,null,null,null,null,null,null,null,null,null,null,null,null,"SAN CRISTOBAL"]
[null,null,null,null,null,null,null,null,null,null,null,null,null,null,3,2,1,2,1,"1.2.1.2.1 No Aplica",null,null,null,null,null,null,null,null,null,null,null,null,null,null,null,null,null,null,null,null,null,null,null,null,null,null,null,null,null,null,null,null,null,null,null,null,null,null,null,null,null,null,null,null,null,null,null,null,null,null,"SAN ESTANISLAO"]
[null,null,null,null,null,null,null,null,null,null,null,null,null,null,3,2,1,3,1,"1.2.1.3.1 No Aplica",null,null,null,null,null,null,null,null,null,null,null,null,null,null,null,null,null,null,null,null,null,null,null,null,null,null,null,null,null,null,null,null,null,null,null,null,null,null,null,null,null,null,null,null,null,null,null,null,null,null,"SAN FERNANDO"]
[null,null,null,null,null,null,null,null,null,null,null,null,null,null,3,2,1,4,1,"1.2.1.4.1 No Aplica",null,null,null,null,null,null,null,null,null,null,null,null,null,null,null,null,null,null,null,null,null,null,null,null,null,null,null,null,null,null,null,null,null,null,null,null,null,null,null,null,null,null,null,null,null,null,null,null,null,null,"SAN JACINTO"]
[null,null,null,null,null,null,null,null,null,null,null,null,null,null,3,2,1,5,1,"1.2.1.5.1 No Aplica",null,null,null,null,null,null,null,null,null,null,null,null,null,null,null,null,null,null,null,null,null,null,null,null,null,null,null,null,null,null,null,null,null,null,null,null,null,null,null,null,null,null,null,null,null,null,null,null,null,null,"SAN JACINTO DEL CAUCA"]
[null,null,null,null,null,null,null,null,null,null,null,null,null,null,3,2,2,1,1,"1.2.2.1.1 No Aplica",null,null,null,null,null,null,null,null,null,null,null,null,null,null,null,null,null,null,null,null,null,null,null,null,null,null,null,null,null,null,null,null,null,null,null,null,null,null,null,null,null,null,null,null,null,null,null,null,null,null,"SAN JUAN NEPOMUCENO"]
[null,null,null,null,null,null,null,null,null,null,null,null,null,null,3,2,2,2,1,"1.2.2.2.1 No Aplica",null,null,null,null,null,null,null,null,null,null,null,null,null,null,null,null,null,null,null,null,null,null,null,null,null,null,null,null,null,null,null,null,null,null,null,null,null,null,null,null,null,null,null,null,null,null,null,null,null,null,"SAN MARTIN DE LOBA"]
[null,null,null,null,null,null,null,null,null,null,null,null,null,null,3,2,3,1,1,"1.2.3.1.1 No Aplica",null,null,null,null,null,null,null,null,null,null,null,null,null,null,null,null,null,null,null,null,null,null,null,null,null,null,null,null,null,null,null,null,null,null,null,null,null,null,null,null,null,null,null,null,null,null,null,null,null,null,"SAN PABLO"]
[null,null,null,null,null,null,null,null,null,null,null,null,null,null,3,2,3,2,1,"1.2.3.2.1 No Aplica",null,null,null,null,null,null,null,null,null,null,null,null,null,null,null,null,null,null,null,null,null,null,null,null,null,null,null,null,null,null,null,null,null,null,null,null,null,null,null,null,null,null,null,null,null,null,null,null,null,null,"SANTA CATALINA"]
[null,null,null,null,null,null,null,null,null,null,null,null,null,null,3,2,4,1,1,"1.2.4.1.1 No Aplica",null,null,null,null,null,null,null,null,null,null,null,null,null,null,null,null,null,null,null,null,null,null,null,null,null,null,null,null,null,null,null,null,null,null,null,null,null,null,null,null,null,null,null,null,null,null,null,null,null,null,"SANTA ROSA"]
[null,null,null,null,null,null,null,null,null,null,null,null,null,null,4,1,1,1,1,"2.1.1.1.1. MinAgricultura, MinSalud y MinAmbiente asegurarán la implementación de la normatividad vigente en materia sanitaria, de bienestar animal, fitosanitaria, de inocuidad y trazabilidad agropecuaria, bajo el enfoque de la granja a la mesa. Adicionalmente, se reglamentará, bajo este mismo enfoque, las cadenas productivas que carecen de marco normativo. Se fomentará también la implementación y certificación de buenas prácticas de producción agropecuaria (BPA), buenas prácticas de manufactura (BPM), sistemas de aseguramiento de la calidad, y demás estándares exigidos y reconocidos en los mercados externos en materia de inocuidad y calidad.",{"$error":"#REF!"},null,null,null,null,null,null,null,null,null,null,null,null,null,null,null,null,null,null,null,null,null,null,null,null,null,null,null,null,null,null,null,null,null,null,null,null,null,null,null,null,null,null,null,null,null,null,null,null,null,"SANTA ROSA DEL SUR"]
[null,null,null,null,null,null,null,null,null,null,null,null,null,null,4,1,1,1,2,"2.1.1.1.2. MinAgricultura, MinSalud, MinComercio y MinAmbiente desarrollarán y fortalecerán las capacidades técnicas (metrológicas, de calibración y de ensayos) de los laboratorios\nque hacen parte del Sistema MSF, de tal forma que provean el soporte técnico, científico y tecnológico para garantizar el cumplimiento de los requisitos sanitarios, fitosanitarios, de inocuidad y de evaluación de la conformidad71. Así mismo, se integrará en esta estrategia al Instituto Nacional de Metrología, para que apoye a las demás entidades del Sistema MSF para la realización de ensayos y pruebas analíticas relacionados con asuntos de interés en sanidad e inocuidad, los cuales, además, tienen repercusión en el comercio internacional.",null,null,null,null,null,null,null,null,null,null,null,null,null,null,null,null,null,null,null,null,null,null,null,null,null,null,null,null,null,null,null,null,null,null,null,null,null,null,null,null,null,null,null,null,null,null,null,null,null,null,"SIMITI"]
[null,null,null,null,null,null,null,null,null,null,null,null,null,null,4,1,1,1,3,"2.1.1.1.3. MinAgricultura y MinSalud, en coordinación con MinAmbiente, fortalecerán la planeación, ejecución, seguimiento y evaluación de los planes de monitoreo de MinAgricultura y MinSalud, en coordinación con MinAmbiente, fortalecerán la planeación, ejecución, seguimiento y evaluación de los planes de monitoreo de",null,null,null,null,null,null,null,null,null,null,null,null,null,null,null,null,null,null,null,null,null,null,null,null,null,null,null,null,null,null,null,null,null,null,null,null,null,null,null,null,null,null,null,null,null,null,null,null,null,null,"SOPLAVIENTO"]
[null,null,null,null,null,null,null,null,null,null,null,null,null,null,4,1,1,1,4,"2.1.1.1.4. MinAgricultura, MinSalud, MinAmbiente, MinTransporte, ICA e INVIMA, de la mano de MinTIC, MinComercio y el sector privado, impulsarán el desarrollo e implementación\nde sistemas de trazabilidad, calidad e inocuidad de alimentos que incluyan todos los agentes de la cadena de valor agropecuaria y agroindustrial.",null,null,null,null,null,null,null,null,null,null,null,null,null,null,null,null,null,null,null,null,null,null,null,null,null,null,null,null,null,null,null,null,null,null,null,null,null,null,null,null,null,null,null,null,null,null,null,null,null,null,"TALAIGUA NUEVO"]
[null,null,null,null,null,null,null,null,null,null,null,null,null,null,5,1,1,1,1,"3.1.1.1.1. Las entidades vinculadas a la estrategia SACÚDETE son: el Ministerio de Comercio, Industria y Turismo (MinCTI), Ministerio de Justicia y del Derecho (MinJusticia), Ministerio\ndel Trabajo (MinTrabajo), Ministerio de Cultura (MinCultura), Ministerio de Salud y Protección Social (MinSalud), Ministerio de Ambiente y Desarrollo Sostenible MinAmbiente), Ministerio de Educación (MinEducación), Ministerio de Tecnologías de la Información y las Comunicaciones (MinTIC), Ministerio de Agricultura y Desarrollo Rural (MinAgricultura), Departamento Nacional de Planeación (DNP), Departamento para la Prosperidad Social (Prosperidad Social), Colciencias, Departamento Administrativo\nNacional de Estadística (DANE), Sena, ICBF y Coldeportes.",null,null,null,null,null,null,null,null,null,null,null,null,null,null,null,null,null,null,null,null,null,null,null,null,null,null,null,null,null,null,null,null,null,null,null,null,null,null,null,null,null,null,null,null,null,null,null,null,null,null,"TIQUISIO"]
[null,null,null,null,null,null,null,null,null,null,null,null,null,null,5,1,2,1,1,"3.1.2.1.1. Las entidades públicas del orden nacional y territorial fortalecerán la oferta juvenil, de manera que deberán garantizar la inclusión de jóvenes en los programas que, por\nsu objeto, permitan su participación o crear programas específicos en la materia. Así mismo, deberán divulgar la información correspondiente a través de Colombia Joven,\ny establecer indicadores frente al particular, reportar la información al DNP y Colombia Joven. Las entidades del orden nacional, responsables de la implementación de esta estrategia, serán, entre otras: MinInterior, MinJusticia, MinAgricultura, MinEducación, MinSalud, MinTrabajo, MinTIC, MinCultura, MinCTI, Cancillería, MinAmbiente, DNP, Prosperidad Social, Colciencias, DANE, Sena, ICBF y\nColdeportes.",null,null,null,null,null,null,null,null,null,null,null,null,null,null,null,null,null,null,null,null,null,null,null,null,null,null,null,null,null,null,null,null,null,null,null,null,null,null,null,null,null,null,null,null,null,null,null,null,null,null,"TURBACO"]
[null,null,null,null,null,null,null,null,null,null,null,null,null,null,6,1,1,1,1,"5.1.1.1.1. El SNCCTI integrará los lineamientos de crecimiento verde y sostenibilidad relacionados con competitividad, ciencia, tecnología e innovación. En particular, se vinculará al\nMinAmbiente dentro de las instancias competentes del SNCCTI.",null,null,null,null,null,null,null,null,null,null,null,null,null,null,null,null,null,null,null,null,null,null,null,null,null,null,null,null,null,null,null,null,null,null,null,null,null,null,null,null,null,null,null,null,null,null,null,null,null,null,"TURBANA"]
[null,null,null,null,null,null,null,null,null,null,null,null,null,null,7,1,1,1,1,"6.1.1.1.1. MinTransporte, en coordinación con MinAmbiente, las entidades concedentes y Dimar, junto con distritos portuarios donde se emplacen puertos, deberán actualizar el\ninstrumento de planificación portuaria y generar un desarrollo articulado de los terminales portuarios con el sistema de ciudades, al priorizar y formular planes maestros\npor zona portuaria que sirvan como insumo a los planes de ordenamiento territorial que se vayan a revisar o formular, cuyos principios se enmarquen en la sostenibilidad,\ncompetitividad y armonización con el desarrollo de los territorios, en articulación con el \"Pacto por la  sostenibilidad: Producir conservando y conservar produciendo\"; Línea C: Colombia Resiliente: conocimiento y prevención para la gestión del riesgo de desastres y la adaptación al cambio climático\"",null,null,null,null,null,null,null,null,null,null,null,null,null,null,null,null,null,null,null,null,null,null,null,null,null,null,null,null,null,null,null,null,null,null,null,null,null,null,null,null,null,null,null,null,null,null,null,null,null,null,"VILLANUEVA"]
[null,null,null,null,null,null,null,null,null,null,null,null,null,null,8,1,1,1,1,"8.1.1.1.1. A través del FENOGE MinEnergía podrá promover la realización de auditorías energéticas en todos los sectores productivos de país; las primeras entidades en implementar estas acciones serán las entidades del sector oficial. MinEnergía o la entidad que este delegue apoyará el desarrollo de proyectos de eficiencia energética con recambio tecnológico en iluminación y electrodomésticos para mejorar los consumos de los usuarios de menores ingresos, alineado con los objetivos en materia de manejo de residuos (Pacto por la Sostenibilidad). Como parte de esta estrategia se iniciará con el Programa de Eficiencia Energética en el Caribe. También estructurará un programa de sustitución de leña y carbón por GLP, en coordinación con el programa de estufas eficientes y huertos leñeros liderado por el MinAmbiente (Pacto por la Sostenibilidad).",null,null,null,null,null,null,null,null,null,null,null,null,null,null,null,null,null,null,null,null,null,null,null,null,null,null,null,null,null,null,null,null,null,null,null,null,null,null,null,null,null,null,null,null,null,null,null,null,null,null,"ZAMBRANO"]
[null,null,null,null,null,null,null,null,null,null,null,null,null,null,8,2,1,1,1,"8.2.1.1.1. MinVivienda, MinAmbiente y el Departamento Nacional de Planeación (DNP) diseñarán lineamientos para que las entidades de la rama ejecutiva del Gobierno nacional elaboren e implementen programas de manejo de residuos sólidos que involucren a la población recicladora de oficio. Dichas entidades deberán llevar registro de las toneladas entregadas a las organizaciones de recicladores y reportarlas de acuerdo con los lineamientos que expida el Gobierno nacional.",null,null,null,null,null,null,null,null,null,null,null,null,null,null,null,null,null,null,null,null,null,null,null,null,null,null,null,null,null,null,null,null,null,null,null,null,null,null,null,null,null,null,null,null,null,null,null,null,null,null,"ALMEIDA"]
[null,null,null,null,null,null,null,null,null,null,null,null,null,null,8,2,2,1,1,"8.2.2.1.1. MinVivienda, en asocio con Ministerio de Ambiente y Desarrollo Sostenible (MinAmbiente), DNP y el Ministerio de Agricultura y Desarrollo Rural (MinAgricultura), impulsarán un esquema de aprovechamiento y tratamiento de residuos orgánicos, a través de alianzas con el sector privado que redunden en soluciones integrales con enfoque de innovación social y de economía circular.",null,null,null,null,null,null,null,null,null,null,null,null,null,null,null,null,null,null,null,null,null,null,null,null,null,null,null,null,null,null,null,null,null,null,null,null,null,null,null,null,null,null,null,null,null,null,null,null,null,null,"AQUITANIA"]
[null,null,null,null,null,null,null,null,null,null,null,null,null,null,8,2,3,1,1,"8.2.3.1.1. MinVivienda, con el apoyo de MinAmbiente, revisará la creación de la institucionalidad necesaria para fortalecer la planeación estratégica a largo plazo del sector de aseo,\ncon enfoque de economía circular36. Adicionalmente, fortalecerán los instrumentos de planeación territorial del servicio (Planes de Gestión Integral de Residuos Sólidos\nPGIRS).",null,null,null,null,null,null,null,null,null,null,null,null,null,null,null,null,null,null,null,null,null,null,null,null,null,null,null,null,null,null,null,null,null,null,null,null,null,null,null,null,null,null,null,null,null,null,null,null,null,null,"ARCABUCO"]
[null,null,null,null,null,null,null,null,null,null,null,null,null,null,8,2,4,1,1,"8.2.4.1.1. El Servicio Geológico Colombiano (SGC) y el Instituto de Hidrología, Meteorología y Estudios Ambientales (IDEAM), con el apoyo de las autoridades ambientales,\nefectuarán el levantamiento de la información hidrogeológica detallada para los sistemas acuíferos identificados y priorizados en los municipios con estrés hídrico, en\nconcordancia con el Pacto por la Ciencia, la Tecnología y la Innovación. Esto, con el objetivo consolidar un modelo hidrogeológico que permita fortalecer los planes ambientales de manejo de acuíferos y analizar su posibilidad de explotación en aquellas zonas del país que registran estrés hídrico y que utilizan fuentes superficiales\npara su abastecimiento. Su priorización se adelantará articuladamente con MinAmbiente y MinVivienda.",null,null,null,null,null,null,null,null,null,null,null,null,null,null,null,null,null,null,null,null,null,null,null,null,null,null,null,null,null,null,null,null,null,null,null,null,null,null,null,null,null,null,null,null,null,null,null,null,null,null,"BELEN"]
[null,null,null,null,null,null,null,null,null,null,null,null,null,null,8,2,4,1,2,"8.2.4.1.2. MinVivienda y MinAmbiente potencializarán el uso sostenible de las aguas subterráneas para mejorar el acceso y la continuidad del servicio en las zonas con estrés hídrico. A su vez, se analizará la recarga artificial de acuíferos como mecanismos para asegurar la sostenibilidad.",null,null,null,null,null,null,null,null,null,null,null,null,null,null,null,null,null,null,null,null,null,null,null,null,null,null,null,null,null,null,null,null,null,null,null,null,null,null,null,null,null,null,null,null,null,null,null,null,null,null,"BERBEO"]
[null,null,null,null,null,null,null,null,null,null,null,null,null,null,8,2,4,1,3,"8.2.4.1.3. MinVivienda, con el apoyo de MinAmbiente, desarrollará modelos de negocio para el abastecimiento en aguas subterráneas y de tratamiento de aguas residuales, garantizando el ingreso de operadores idóneos.",null,null,null,null,null,null,null,null,null,null,null,null,null,null,null,null,null,null,null,null,null,null,null,null,null,null,null,null,null,null,null,null,null,null,null,null,null,null,null,null,null,null,null,null,null,null,null,null,null,null,"BETEITIVA"]
[null,null,null,null,null,null,null,null,null,null,null,null,null,null,8,2,4,2,1,"8.2.4.2.1. MinAmbiente modificará la norma de reúso con enfoque de economía circular, con el fin de incentivar el reúso del agua residual tratada.",null,null,null,null,null,null,null,null,null,null,null,null,null,null,null,null,null,null,null,null,null,null,null,null,null,null,null,null,null,null,null,null,null,null,null,null,null,null,null,null,null,null,null,null,null,null,null,null,null,null,"BOAVITA"]
[null,null,null,null,null,null,null,null,null,null,null,null,null,null,8,2,4,3,1,"8.2.4.3.1. MinVivienda, con el apoyo del MinAmbiente y el soporte técnico del IDEAM, en el marco del Plan Nacional de Manejo Aguas Residuales (PMAR), priorizará las cuencas hidrográficas del país, en donde se deban realizar intervenciones prioritarias en materia de fortalecimiento institucional e implementación de sistemas y tecnologías de tratamiento de aguas residuales para la descontaminación de dichos cuerpos de agua.",null,null,null,null,null,null,null,null,null,null,null,null,null,null,null,null,null,null,null,null,null,null,null,null,null,null,null,null,null,null,null,null,null,null,null,null,null,null,null,null,null,null,null,null,null,null,null,null,null,null,"BOYACA"]
[null,null,null,null,null,null,null,null,null,null,null,null,null,null,8,2,4,3,2,"8.2.4.3.2. MinVivienda apoyará el proceso de ajuste, seguimiento y actualización de los Planes de Saneamiento y Manejo de Vertimientos (PSMV) por parte de los prestadores de\nservicio público de alcantarillado, para que estos cuenten con fuentes de financiación ciertas, en el marco del Plan Nacional de Manejo Aguas Residuales (PMAR). Adicionalmente, MinAmbiente evaluará la Tasa Retributiva por Vertimientos Puntuales a los cuerpos de agua, para identificar los aspectos susceptibles de mejora en las\netapas de diseño, implementación y seguimiento. Con base en lo anterior, condicionará el factor regional, de tal manera que se reduzca el posible impacto económico generado sobre los prestadores del servicio público de alcantarillado.",null,null,null,null,null,null,null,null,null,null,null,null,null,null,null,null,null,null,null,null,null,null,null,null,null,null,null,null,null,null,null,null,null,null,null,null,null,null,null,null,null,null,null,null,null,null,null,null,null,null,"BRICEÑO"]
[null,null,null,null,null,null,null,null,null,null,null,null,null,null,8,2,4,3,3,"8.2.4.3.3. A partir del análisis de la implementación de la norma de vertimiento, objetivos de calidad, ordenamiento del recurso hídrico, las tarifas, multas y regulación asociadas al sistema de alcantarillado, y en función de los resultados de PMAR, MinAmbiente, MinVivienda y la CRA efectuaran los ajustes normativos en el marco de sus competencias para que su instrumentación sea aplicable a las diferentes necesidades en el territorio.",null,null,null,null,null,null,null,null,null,null,null,null,null,null,null,null,null,null,null,null,null,null,null,null,null,null,null,null,null,null,null,null,null,null,null,null,null,null,null,null,null,null,null,null,null,null,null,null,null,null,"BUENAVISTA"]
[null,null,null,null,null,null,null,null,null,null,null,null,null,null,8,2,4,3,4,"8.2.4.3.4. MinAmbiente, a partir de la información de seguimiento a los permisos de vertimiento, al recaudo de las tasas retributivas y a las licencias ambientales reportadas por las\nautoridades ambientales regionales y el ANLA, generará una línea base y un mecanismo de seguimiento anual de las cargas contaminantes removidas por el\nSector de Agua Potable y Saneamiento Básico (APSB). En el marco de sus competencias, MinAmbiente y MinVivienda articularán los instrumentos de\nplanificación y administración del recurso hídrico y de saneamiento de agua potable con los demás instrumentos financieros, a través de una estrategia regional que\nfocalice las inversiones de los diferentes actores, con el fin de aportar al mejoramiento de la calidad de las aguas.",null,null,null,null,null,null,null,null,null,null,null,null,null,null,null,null,null,null,null,null,null,null,null,null,null,null,null,null,null,null,null,null,null,null,null,null,null,null,null,null,null,null,null,null,null,null,null,null,null,null,"BUSBANZA"]
[null,null,null,null,null,null,null,null,null,null,null,null,null,null,8,2,5,1,1,"8.2.5.1.1. El Ministerio de Educación Nacional (MinEducación), MinAmbiente y MinVivienda fortalecerán las estrategias de la política nacional de educación ambiental, mediante la reglamentación de las características que deben contener los programas de educación ambiental, en cuanto a: (1) protección de las cuencas hídricas como fuente de vida, desarrollo y entretenimiento; (2) correcto uso del agua en sus diferentes formas de utilización; y (3) conocimiento del adecuado manejo, aprovechamiento y disposición de los residuos sólidos.",null,null,null,null,null,null,null,null,null,null,null,null,null,null,null,null,null,null,null,null,null,null,null,null,null,null,null,null,null,null,null,null,null,null,null,null,null,null,null,null,null,null,null,null,null,null,null,null,null,null,"CALDAS"]
[null,null,null,null,null,null,null,null,null,null,null,null,null,null,8,2,6,1,1,"8.2.6.1.1. MinAmbiente, MinVivienda y la CRA ajustarán las normas para internalizar los costos ambientales y de riesgo a la salud por cuenta del manejo inadecuado de residuos, de tal manera que se pueda financiar infraestructura para el aprovechamiento y tratamiento de residuos sólidos. Esto contribuirá al cumplimiento de la meta de reducción del 20 % de los gases de efecto invernadero generados por el sector residuos (en el marco del Acuerdo de París) y permitirá la generación de infraestructura y empleos verdes de la línea A del Pacto por la Sostenibilidad.",null,null,null,null,null,null,null,null,null,null,null,null,null,null,null,null,null,null,null,null,null,null,null,null,null,null,null,null,null,null,null,null,null,null,null,null,null,null,null,null,null,null,null,null,null,null,null,null,null,null,"CAMPOHERMOSO"]
[null,null,null,null,null,null,null,null,null,null,null,null,null,null,9,1,1,1,1,"9.1.1.1.1. En cuanto a los instrumentos de control y seguimiento ambiental (permisos y licencia ambiental), el MinAmbiente o la entidad que este delegue, avanzará en los siguientes frentes: (1) ajuste de los términos de referencia en que estos se basan y de su trámite, de manera que se adecúen al tamaño de los proyectos, método de producción y tipo de mineral incluyendo11 parámetros de cumplimiento asociados con los procesos de cierre, para mitigar, compensar y prevenir los impactos ambientales durante el desarrollo de los proyectos mineros; también, para prevenir la configuración de riesgos ambientales y sociales, producto de la inadecuada finalización y al abandono de aquellos; (2) definición de los instrumentos ambientales que serán aplicables a los procesos de formalización; y (3) expedición por parte del MinEnergía, con apoyo del MinAmbiente, de la normatividad minero ambiental aplicable a la minería de subsistencia.",null,null,null,null,null,null,null,null,null,null,null,null,null,null,null,null,null,null,null,null,null,null,null,null,null,null,null,null,null,null,null,null,null,null,null,null,null,null,null,null,null,null,null,null,null,null,null,null,null,null,"CERINZA"]
[null,null,null,null,null,null,null,null,null,null,null,null,null,null,9,1,1,2,1,"9.1.1.2.1. Se fortalecerá el programa de formalización y fomento minero con la incorporación de una visión de emprendimiento e inclusión financiera del negocio minero, comprendiendo innovación tecnológica, tecnologías duras, modelos de acceso a recursos de inversión, entre otros. El MinEnergía implementará proyectos y programas de asistencia técnica para los pequeños mineros, con la exigencia de estándares y buenas prácticas mineras, enfocados en producción más limpia, transferencia tecnológica, capacitación y acompañamiento técnico, con el fin de promover mejores condiciones laborales y prácticas productivas más eficientes y responsables con el medio ambiente, que contribuyan a generar confianza en el sector minero y a tener mejores operadores en el territorio. Asimismo, el MinAmbiente implementará mecanismos de seguimiento para monitoreo de sustancias químicas provenientes de la actividad minera en cuerpos de agua, en cumplimiento del Convenio de Minamata y demás normatividad vigente (Pacto por la Sostenibilidad).",null,null,null,null,null,null,null,null,null,null,null,null,null,null,null,null,null,null,null,null,null,null,null,null,null,null,null,null,null,null,null,null,null,null,null,null,null,null,null,null,null,null,null,null,null,null,null,null,null,null,"CHINAVITA"]
[null,null,null,null,null,null,null,null,null,null,null,null,null,null,9,2,1,1,1,"9.2.1.1.1. La ANH establecerá las zonas para la exploración y producción de los yacimientos no convencionales y el MinEnergía y el MinAmbiente actualizarán, de ser necesario, la\nregulación técnica y ambiental específica para su exploración y producción. Adicionalmente, el MinAmbiente expedirá los términos de referencia para el estudio de impacto ambiental referente a la explotación de estos yacimientos. Simultáneamente, bajo el nuevo modelo de relacionamiento del sector minero-energético, la ANH implementará campañas de comunicación, mediante las cuales se brindará información a las diferentes instancias de decisión y grupos de interés para adelantar su aprovechamiento. El fortalecimiento del conocimiento de los funcionarios en las entidades con responsabilidades en la reglamentación y fiscalización de la actividad será una prioridad del Gobierno nacional.",null,null,null,null,null,null,null,null,null,null,null,null,null,null,null,null,null,null,null,null,null,null,null,null,null,null,null,null,null,null,null,null,null,null,null,null,null,null,null,null,null,null,null,null,null,null,null,null,null,null,"CHIQUINQUIRA"]
[null,null,null,null,null,null,null,null,null,null,null,null,null,null,9,2,1,1,2,"9.2.1.1.2. Desde el MinAmbiente se expedirán los términos de referencia para la elaboración de estudios de impacto ambiental requeridos en el proceso de licenciamiento ambiental para proyectos de exploración y producción de hidrocarburos costa afuera conforme con las mejores prácticas internacionales, emitirá el Manual de compensación de ecosistemas marino-costeros, el Programa de Exploración Sísmica Marina y demás mecanismos e instrumentos que requiera para garantizar que la operación hidrocarburífera costa afuera garantice los mejores estándares ambientales. Paralelamente la ANH creará mecanismos para fortalecer la fiscalización de dichas actividades.",null,null,null,null,null,null,null,null,null,null,null,null,null,null,null,null,null,null,null,null,null,null,null,null,null,null,null,null,null,null,null,null,null,null,null,null,null,null,null,null,null,null,null,null,null,null,null,null,null,null,"CHIQUIZA"]
[null,null,null,null,null,null,null,null,null,null,null,null,null,null,9,2,1,2,1,"9.2.1.2.1. El Servicio Geológico Colombiano (SGC) adelantará investigaciones para caracterizar las áreas geotérmicas del país e implementará la metodología para estimar el potencial geotérmico. Por su parte, la UPME adelantará estudios sobre el desarrollo integral y estrategias de política alrededor del aprovechamiento geotérmico. El MinEnergía establecerá la política de asignación de áreas, los instrumentos contractuales para desarrollar las actividades de exploración y explotación del recurso y la entidad encargada de administrarlo. Así mismo, se conformarán mesas de trabajo con el MinAmbiente, la ANLA, la CREG y el SGC para lograr establecer el marco regulatorio que permita el uso adecuado de este recurso en el país, bajo el cumplimiento estricto de la Ley 1930 de 2018, correspondiente a la conservación de los páramos como ecosistemas estratégicos del país (Pacto por la Sostenibilidad).",null,null,null,null,null,null,null,null,null,null,null,null,null,null,null,null,null,null,null,null,null,null,null,null,null,null,null,null,null,null,null,null,null,null,null,null,null,null,null,null,null,null,null,null,null,null,null,null,null,null,"CHISCAS"]
[null,null,null,null,null,null,null,null,null,null,null,null,null,null,9,2,1,3,1,"9.2.1.3.1. La UPME actualizará el atlas de biomasa y en conjunto con el MinEnergía, desarrollará herramientas e instrumentos que permitan viabilizar los proyectos de generación de energía a partir de biomasa, para así contribuir en la complementación de los combustibles fósiles y/o incrementar la cobertura del servicio público de energía eléctrica y gas combustible en zonas rurales y no interconectadas, de acuerdo con sus particularidades. Adicionalmente, en la agenda de cooperación técnica internacional se incorporará apoyo en el desarrollo de nuevas tecnologías, sistemas e innovación para la generación de energía a partir de esta fuente. Por otra parte, el MinAmbiente y las autoridades ambientales regionales revisarán la reglamentación ambiental y la estrategia de participación de ciudades en el uso de los rellenos sanitarios y de plantas de tratamiento de aguas residuales (PTAR) en la producción de biogás, de manera que se logre el aprovechamiento energético de residuos y aguas residuales municipales, procesos vinculados a maximizar y potencializar los impactos positivos derivados de la política de economía circular (Pacto por la Sostenibilidad).",null,null,null,null,null,null,null,null,null,null,null,null,null,null,null,null,null,null,null,null,null,null,null,null,null,null,null,null,null,null,null,null,null,null,null,null,null,null,null,null,null,null,null,null,null,null,null,null,null,null,"CHITA"]
[null,null,null,null,null,null,null,null,null,null,null,null,null,null,9,2,2,1,1,"9.2.2.1.1. El MinEnergía y el MinAmbiente continuarán trabajando en la actualización de los parámetros de calidad de los combustibles y biocombustibles. Con el fin de asegurar el suministro de refinados en la cantidad, calidad y oportunidad requeridos, el MinEnergía o la entidad que delegue evaluará las características y capacidad de refinación y de importación requerida por el país (Pacto por la Sostenibilidad).",null,null,null,null,null,null,null,null,null,null,null,null,null,null,null,null,null,null,null,null,null,null,null,null,null,null,null,null,null,null,null,null,null,null,null,null,null,null,null,null,null,null,null,null,null,null,null,null,null,null,"CHITARAQUE"]
[null,null,null,null,null,null,null,null,null,null,null,null,null,null,9,2,2,2,1,"9.2.2.2.1. Como parte de la política de incentivar la generación con energías limpias se debe considerar que Colombia cuenta con  un potencial importante de hidroenergía no desarrollado, el\"Plan de expansión de referencia de generación\" prevé la incorporación de nueva capacidad usando este recurso, para lo cual la UPME hará los estudios pertinentes. Por su parte, el MinAmbiente desarrollará la normativa ambiental que permita su uso como energético estratégico, en armonía con los usos alternos y los servicios ecosistémicos.",null,null,null,null,null,null,null,null,null,null,null,null,null,null,null,null,null,null,null,null,null,null,null,null,null,null,null,null,null,null,null,null,null,null,null,null,null,null,null,null,null,null,null,null,null,null,null,null,null,null,"CHIVATA"]
[null,null,null,null,null,null,null,null,null,null,null,null,null,null,10,1,1,1,1,"12.1.1.1.1. MinAmbiente, con apoyo de MinInterior, fortalecerá las capacidades de comunidades locales en temas relacionados con la gestión ambiental y desarrollo sostenible, como insumo para generar diálogos propositivos que incluyan a mujeres y hombres de las comunidades étnicas en los procesos de prevención y transformación de los conflictos socioambientales para la gobernanza ambiental de los territorios.",null,null,null,null,null,null,null,null,null,null,null,null,null,null,null,null,null,null,null,null,null,null,null,null,null,null,null,null,null,null,null,null,null,null,null,null,null,null,null,null,null,null,null,null,null,null,null,null,null,null,"CHIVOR"]
[null,null,null,null,null,null,null,null,null,null,null,null,null,null,11,1,1,1,1,"13.1.1.1.1. El Ministerio de Transporte, en coordinación con el MinInterior, Min Vivienda, MinSalud, MinEducación, MinTIC, MinAmbiente, el Departamento Administrativo de la Función\nPública, el DNP y la Consejería Presidencial para la Participación de las Personas con Discapacidad, con la participación de las entidades públicas que concurren al Consejo\nNacional de Discapacidad, formulará un Plan Nacional de Accesibilidad que asegure que el entorno físico de las instalaciones públicas o privadas abiertas al público, el transporte, la información y comunicación, incluyendo las tecnologías de la información y la comunicación, sigan los estándares reconocidos internacionalmente, y tengan cobertura en todo el territorio nacional. El Plan Nacional de Accesibilidad deberá ser adoptado e implementado por todas las entidades públicas del orden nacional y territorial.",null,null,null,null,null,null,null,null,null,null,null,null,null,null,null,null,null,null,null,null,null,null,null,null,null,null,null,null,null,null,null,null,null,null,null,null,null,null,null,null,null,null,null,null,null,null,null,null,null,null,"CIENEGA"]
[null,null,null,null,null,null,null,null,null,null,null,null,null,null,12,1,1,1,1,"16.1.1.1.1. MinVivienda promoverá la formulación e implementación de PP, AUI y macroproyectos urbanos mediante las siguientes acciones: (1) con el apoyo del DNP y Ministerio de\nAmbiente y Desarrollo Sostenible (MinAmbiente), actualización de la reglamentación específica y diferencial para PP de renovación urbana y desarrollo; y (2) apoyados por la\nUnidad Nacional de Gestión del Riesgo de Desastres (UNGRD) y el Instituto de Hidrología, Meteorología y Estudios Ambientales (IDEAM), creación de un programa de generación de capacidades institucionales y asistencia técnica para la promoción de instrumentos de planificación intermedia como PP, AUI y macroproyectos urbanos con énfasis en la incorporación de criterios de sostenibilidad asociados a la gestión de riesgo y escenarios de cambio climático.",null,null,null,null,null,null,null,null,null,null,null,null,null,null,null,null,null,null,null,null,null,null,null,null,null,null,null,null,null,null,null,null,null,null,null,null,null,null,null,null,null,null,null,null,null,null,null,null,null,null,"COMBITA"]
[null,null,null,null,null,null,null,null,null,null,null,null,null,null,12,1,1,1,2,"16.1.1.1.2. MinVivienda, en coordinación con el Ministerio de Transporte (MinTransporte), MinAmbiente y la Financiera de Desarrollo Territorial (FINDETER), fomentará la implementación de medidas enmarcadas en el modelo de Desarrollo Orientado al Transporte DOT, tales como la NAMA TOD44, que articula el transporte público de\npasajeros con la gestión de estacionamientos, zonas de empleo, vivienda y comercio a distancias caminables, densificación y usos de suelo mixto, así como alta accesibilidad\npeatonal e intermodal a bienes y servicios (Pacto por el Transporte).",null,null,null,null,null,null,null,null,null,null,null,null,null,null,null,null,null,null,null,null,null,null,null,null,null,null,null,null,null,null,null,null,null,null,null,null,null,null,null,null,null,null,null,null,null,null,null,null,null,null,"COPER"]
[null,null,null,null,null,null,null,null,null,null,null,null,null,null,12,1,1,1,3,"16.1.1.1.3. MinVivienda, con el apoyo del DNP y MinAmbiente, elaborará lineamientos encaminados a definir los estándares técnicos y las guías de diseño geométrico y funcional, para el\nmejoramiento de la calidad, acceso y particularidades ambientales al EP. Así mismo, crearán instrumentos de medición y seguimiento de metas de EP que se sistematizarán\nen un módulo del Observatorio del Sistema de Ciudades (OSC).",null,null,null,null,null,null,null,null,null,null,null,null,null,null,null,null,null,null,null,null,null,null,null,null,null,null,null,null,null,null,null,null,null,null,null,null,null,null,null,null,null,null,null,null,null,null,null,null,null,null,"CORRALES"]
[null,null,null,null,null,null,null,null,null,null,null,null,null,null,12,1,1,1,4,"16.1.1.1.4. El Ministerio de Agricultura y Desarrollo Rural (MinAgricultura), a través de la Unidad de Planificación Rural Agropecuaria (UPRA) y MinAmbiente, con el apoyo de MinVivienda, establecerán los criterios técnicos para el uso y planificación de las categorías de suelo rural, en áreas de desarrollo restringido tales como suelos suburbanos, centros poblados y áreas destinadas a vivienda campestre.",null,null,null,null,null,null,null,null,null,null,null,null,null,null,null,null,null,null,null,null,null,null,null,null,null,null,null,null,null,null,null,null,null,null,null,null,null,null,null,null,null,null,null,null,null,null,null,null,null,null,"COVARACHIA"]
[null,null,null,null,null,null,null,null,null,null,null,null,null,null,12,2,1,1,1,"16.2.1.1.1. Bajo el liderazgo de MinAmbiente y junto con el MinHacienda, particularmente en municipios con extensas áreas de protección, promover incentivos como el Pago de Servicios Ambientales (PSA) a gobiernos municipales o la certificación de huella de carbono para acceder a otras bolsas de recursos",null,null,null,null,null,null,null,null,null,null,null,null,null,null,null,null,null,null,null,null,null,null,null,null,null,null,null,null,null,null,null,null,null,null,null,null,null,null,null,null,null,null,null,null,null,null,null,null,null,null,"CUBARA"]
[null,null,null,null,null,null,null,null,null,null,null,null,null,null,12,2,2,1,1,"16.2.2.1.1. El DNP, junto con el MinHacienda, MinEducación, MinSalud y MinAmbiente, ajustará la estrategia de MSC al SGP de manera integral, de acuerdo con parámetros técnicos\nsectoriales, procedimentales y de competencias, de tal manera que permita la identificación de alertas tempranas basadas en evidencias que fortalezcan los procesos de intervención con oportunidad del Gobierno nacional (preventivos/ correctivos), durante todas las fases del ciclo de la inversión. También deberá promover el uso de los resultados de la estrategia en los índices de priorización de la inversión y definición de ejecutores de proyectos financiados con el SGR51, así como dentro de los procesos de seguimiento desplegado por las veedurías ciudadanas.",null,null,null,null,null,null,null,null,null,null,null,null,null,null,null,null,null,null,null,null,null,null,null,null,null,null,null,null,null,null,null,null,null,null,null,null,null,null,null,null,null,null,null,null,null,null,null,null,null,null,"CUCAITA"]
[null,null,null,null,null,null,null,null,null,null,null,null,null,null,null,null,null,null,null,null,null,null,null,null,null,null,null,null,null,null,null,null,null,null,null,null,null,null,null,null,null,null,null,null,null,null,null,null,null,null,null,null,null,null,null,null,null,null,null,null,null,null,null,null,null,null,null,null,null,null,"CUITIVA"]
[null,null,null,null,null,null,null,null,null,null,null,null,null,null,null,null,null,null,null,null,null,null,null,null,null,null,null,null,null,null,null,null,null,null,null,null,null,null,null,null,null,null,null,null,null,null,null,null,null,null,null,null,null,null,null,null,null,null,null,null,null,null,null,null,null,null,null,null,null,null,"DUITAMA"]
[null,null,null,null,null,null,null,null,null,null,null,null,null,null,null,null,null,null,null,null,null,null,null,null,null,null,null,null,null,null,null,null,null,null,null,null,null,null,null,null,null,null,null,null,null,null,null,null,null,null,null,null,null,null,null,null,null,null,null,null,null,null,null,null,null,null,null,null,null,null,"EL COCUY"]
[null,null,null,null,null,null,null,null,null,null,null,null,null,null,null,null,null,null,null,null,null,null,null,null,null,null,null,null,null,null,null,null,null,null,null,null,null,null,null,null,null,null,null,null,null,null,null,null,null,null,null,null,null,null,null,null,null,null,null,null,null,null,null,null,null,null,null,null,null,null,"EL ESPINO"]
[null,null,null,null,null,null,null,null,null,null,null,null,null,null,null,null,null,null,null,null,null,null,null,null,null,null,null,null,null,null,null,null,null,null,null,null,null,null,null,null,null,null,null,null,null,null,null,null,null,null,null,null,null,null,null,null,null,null,null,null,null,null,null,null,null,null,null,null,null,null,"FIRAVITOBA"]
[null,null,null,null,null,null,null,null,null,null,null,null,null,null,null,null,null,null,null,null,null,null,null,null,null,null,null,null,null,null,null,null,null,null,null,null,null,null,null,null,null,null,null,null,null,null,null,null,null,null,null,null,null,null,null,null,null,null,null,null,null,null,null,null,null,null,null,null,null,null,"FLORESTA"]
[null,null,null,null,null,null,null,null,null,null,null,null,null,null,null,null,null,null,null,null,null,null,null,null,null,null,null,null,null,null,null,null,null,null,null,null,null,null,null,null,null,null,null,null,null,null,null,null,null,null,null,null,null,null,null,null,null,null,null,null,null,null,null,null,null,null,null,null,null,null,"GACHANTIVA"]
[null,null,null,null,null,null,null,null,null,null,null,null,null,null,null,null,null,null,null,null,null,null,null,null,null,null,null,null,null,null,null,null,null,null,null,null,null,null,null,null,null,null,null,null,null,null,null,null,null,null,null,null,null,null,null,null,null,null,null,null,null,null,null,null,null,null,null,null,null,null,"GAMEZA"]
[null,null,null,null,null,null,null,null,null,null,null,null,null,null,null,null,null,null,null,null,null,null,null,null,null,null,null,null,null,null,null,null,null,null,null,null,null,null,null,null,null,null,null,null,null,null,null,null,null,null,null,null,null,null,null,null,null,null,null,null,null,null,null,null,null,null,null,null,null,null,"GARAGOA"]
[null,null,null,null,null,null,null,null,null,null,null,null,null,null,null,null,null,null,null,null,null,null,null,null,null,null,null,null,null,null,null,null,null,null,null,null,null,null,null,null,null,null,null,null,null,null,null,null,null,null,null,null,null,null,null,null,null,null,null,null,null,null,null,null,null,null,null,null,null,null,"GsICAN"]
[null,null,null,null,null,null,null,null,null,null,null,null,null,null,null,null,null,null,null,null,null,null,null,null,null,null,null,null,null,null,null,null,null,null,null,null,null,null,null,null,null,null,null,null,null,null,null,null,null,null,null,null,null,null,null,null,null,null,null,null,null,null,null,null,null,null,null,null,null,null,"GUACAMAYAS"]
[null,null,null,null,null,null,null,null,null,null,null,null,null,null,null,null,null,null,null,null,null,null,null,null,null,null,null,null,null,null,null,null,null,null,null,null,null,null,null,null,null,null,null,null,null,null,null,null,null,null,null,null,null,null,null,null,null,null,null,null,null,null,null,null,null,null,null,null,null,null,"GUATEQUE"]
[null,null,null,null,null,null,null,null,null,null,null,null,null,null,null,null,null,null,null,null,null,null,null,null,null,null,null,null,null,null,null,null,null,null,null,null,null,null,null,null,null,null,null,null,null,null,null,null,null,null,null,null,null,null,null,null,null,null,null,null,null,null,null,null,null,null,null,null,null,null,"GUAYATA"]
[null,null,null,null,null,null,null,null,null,null,null,null,null,null,null,null,null,null,null,null,null,null,null,null,null,null,null,null,null,null,null,null,null,null,null,null,null,null,null,null,null,null,null,null,null,null,null,null,null,null,null,null,null,null,null,null,null,null,null,null,null,null,null,null,null,null,null,null,null,null,"IZA"]
[null,null,null,null,null,null,null,null,null,null,null,null,null,null,null,null,null,null,null,null,null,null,null,null,null,null,null,null,null,null,null,null,null,null,null,null,null,null,null,null,null,null,null,null,null,null,null,null,null,null,null,null,null,null,null,null,null,null,null,null,null,null,null,null,null,null,null,null,null,null,"JENESANO"]
[null,null,null,null,null,null,null,null,null,null,null,null,null,null,null,null,null,null,null,null,null,null,null,null,null,null,null,null,null,null,null,null,null,null,null,null,null,null,null,null,null,null,null,null,null,null,null,null,null,null,null,null,null,null,null,null,null,null,null,null,null,null,null,null,null,null,null,null,null,null,"JERICO"]
[null,null,null,null,null,null,null,null,null,null,null,null,null,null,null,null,null,null,null,null,null,null,null,null,null,null,null,null,null,null,null,null,null,null,null,null,null,null,null,null,null,null,null,null,null,null,null,null,null,null,null,null,null,null,null,null,null,null,null,null,null,null,null,null,null,null,null,null,null,null,"LA CAPILLA"]
[null,null,null,null,null,null,null,null,null,null,null,null,null,null,null,null,null,null,null,null,null,null,null,null,null,null,null,null,null,null,null,null,null,null,null,null,null,null,null,null,null,null,null,null,null,null,null,null,null,null,null,null,null,null,null,null,null,null,null,null,null,null,null,null,null,null,null,null,null,null,"LA UVITA"]
[null,null,null,null,null,null,null,null,null,null,null,null,null,null,null,null,null,null,null,null,null,null,null,null,null,null,null,null,null,null,null,null,null,null,null,null,null,null,null,null,null,null,null,null,null,null,null,null,null,null,null,null,null,null,null,null,null,null,null,null,null,null,null,null,null,null,null,null,null,null,"LA VICTORIA"]
[null,null,null,null,null,null,null,null,null,null,null,null,null,null,null,null,null,null,null,null,null,null,null,null,null,null,null,null,null,null,null,null,null,null,null,null,null,null,null,null,null,null,null,null,null,null,null,null,null,null,null,null,null,null,null,null,null,null,null,null,null,null,null,null,null,null,null,null,null,null,"LABRANZAGRANDE"]
[null,null,null,null,null,null,null,null,null,null,null,null,null,null,null,null,null,null,null,null,null,null,null,null,null,null,null,null,null,null,null,null,null,null,null,null,null,null,null,null,null,null,null,null,null,null,null,null,null,null,null,null,null,null,null,null,null,null,null,null,null,null,null,null,null,null,null,null,null,null,"MACANAL"]
[null,null,null,null,null,null,null,null,null,null,null,null,null,null,null,null,null,null,null,null,null,null,null,null,null,null,null,null,null,null,null,null,null,null,null,null,null,null,null,null,null,null,null,null,null,null,null,null,null,null,null,null,null,null,null,null,null,null,null,null,null,null,null,null,null,null,null,null,null,null,"MARIPI"]
[null,null,null,null,null,null,null,null,null,null,null,null,null,null,null,null,null,null,null,null,null,null,null,null,null,null,null,null,null,null,null,null,null,null,null,null,null,null,null,null,null,null,null,null,null,null,null,null,null,null,null,null,null,null,null,null,null,null,null,null,null,null,null,null,null,null,null,null,null,null,"MIRAFLORES"]
[null,null,null,null,null,null,null,null,null,null,null,null,null,null,null,null,null,null,null,null,null,null,null,null,null,null,null,null,null,null,null,null,null,null,null,null,null,null,null,null,null,null,null,null,null,null,null,null,null,null,null,null,null,null,null,null,null,null,null,null,null,null,null,null,null,null,null,null,null,null,"MONGUA"]
[null,null,null,null,null,null,null,null,null,null,null,null,null,null,null,null,null,null,null,null,null,null,null,null,null,null,null,null,null,null,null,null,null,null,null,null,null,null,null,null,null,null,null,null,null,null,null,null,null,null,null,null,null,null,null,null,null,null,null,null,null,null,null,null,null,null,null,null,null,null,"MONGUI"]
[null,null,null,null,null,null,null,null,null,null,null,null,null,null,null,null,null,null,null,null,null,null,null,null,null,null,null,null,null,null,null,null,null,null,null,null,null,null,null,null,null,null,null,null,null,null,null,null,null,null,null,null,null,null,null,null,null,null,null,null,null,null,null,null,null,null,null,null,null,null,"MONIQUIRA"]
[null,null,null,null,null,null,null,null,null,null,null,null,null,null,null,null,null,null,null,null,null,null,null,null,null,null,null,null,null,null,null,null,null,null,null,null,null,null,null,null,null,null,null,null,null,null,null,null,null,null,null,null,null,null,null,null,null,null,null,null,null,null,null,null,null,null,null,null,null,null,"MOTAVITA"]
[null,null,null,null,null,null,null,null,null,null,null,null,null,null,null,null,null,null,null,null,null,null,null,null,null,null,null,null,null,null,null,null,null,null,null,null,null,null,null,null,null,null,null,null,null,null,null,null,null,null,null,null,null,null,null,null,null,null,null,null,null,null,null,null,null,null,null,null,null,null,"MUZO"]
[null,null,null,null,null,null,null,null,null,null,null,null,null,null,null,null,null,null,null,null,null,null,null,null,null,null,null,null,null,null,null,null,null,null,null,null,null,null,null,null,null,null,null,null,null,null,null,null,null,null,null,null,null,null,null,null,null,null,null,null,null,null,null,null,null,null,null,null,null,null,"NOBSA"]
[null,null,null,null,null,null,null,null,null,null,null,null,null,null,null,null,null,null,null,null,null,null,null,null,null,null,null,null,null,null,null,null,null,null,null,null,null,null,null,null,null,null,null,null,null,null,null,null,null,null,null,null,null,null,null,null,null,null,null,null,null,null,null,null,null,null,null,null,null,null,"NUEVO COLON"]
[null,null,null,null,null,null,null,null,null,null,null,null,null,null,null,null,null,null,null,null,null,null,null,null,null,null,null,null,null,null,null,null,null,null,null,null,null,null,null,null,null,null,null,null,null,null,null,null,null,null,null,null,null,null,null,null,null,null,null,null,null,null,null,null,null,null,null,null,null,null,"OICATA"]
[null,null,null,null,null,null,null,null,null,null,null,null,null,null,null,null,null,null,null,null,null,null,null,null,null,null,null,null,null,null,null,null,null,null,null,null,null,null,null,null,null,null,null,null,null,null,null,null,null,null,null,null,null,null,null,null,null,null,null,null,null,null,null,null,null,null,null,null,null,null,"OTANCHE"]
[null,null,null,null,null,null,null,null,null,null,null,null,null,null,null,null,null,null,null,null,null,null,null,null,null,null,null,null,null,null,null,null,null,null,null,null,null,null,null,null,null,null,null,null,null,null,null,null,null,null,null,null,null,null,null,null,null,null,null,null,null,null,null,null,null,null,null,null,null,null,"PACHAVITA"]
[null,null,null,null,null,null,null,null,null,null,null,null,null,null,null,null,null,null,null,null,null,null,null,null,null,null,null,null,null,null,null,null,null,null,null,null,null,null,null,null,null,null,null,null,null,null,null,null,null,null,null,null,null,null,null,null,null,null,null,null,null,null,null,null,null,null,null,null,null,null,"PAEZ"]
[null,null,null,null,null,null,null,null,null,null,null,null,null,null,null,null,null,null,null,null,null,null,null,null,null,null,null,null,null,null,null,null,null,null,null,null,null,null,null,null,null,null,null,null,null,null,null,null,null,null,null,null,null,null,null,null,null,null,null,null,null,null,null,null,null,null,null,null,null,null,"PAIPA"]
[null,null,null,null,null,null,null,null,null,null,null,null,null,null,null,null,null,null,null,null,null,null,null,null,null,null,null,null,null,null,null,null,null,null,null,null,null,null,null,null,null,null,null,null,null,null,null,null,null,null,null,null,null,null,null,null,null,null,null,null,null,null,null,null,null,null,null,null,null,null,"PAJARITO"]
[null,null,null,null,null,null,null,null,null,null,null,null,null,null,null,null,null,null,null,null,null,null,null,null,null,null,null,null,null,null,null,null,null,null,null,null,null,null,null,null,null,null,null,null,null,null,null,null,null,null,null,null,null,null,null,null,null,null,null,null,null,null,null,null,null,null,null,null,null,null,"PANQUEBA"]
[null,null,null,null,null,null,null,null,null,null,null,null,null,null,null,null,null,null,null,null,null,null,null,null,null,null,null,null,null,null,null,null,null,null,null,null,null,null,null,null,null,null,null,null,null,null,null,null,null,null,null,null,null,null,null,null,null,null,null,null,null,null,null,null,null,null,null,null,null,null,"PAUNA"]
[null,null,null,null,null,null,null,null,null,null,null,null,null,null,null,null,null,null,null,null,null,null,null,null,null,null,null,null,null,null,null,null,null,null,null,null,null,null,null,null,null,null,null,null,null,null,null,null,null,null,null,null,null,null,null,null,null,null,null,null,null,null,null,null,null,null,null,null,null,null,"PAYA"]
[null,null,null,null,null,null,null,null,null,null,null,null,null,null,null,null,null,null,null,null,null,null,null,null,null,null,null,null,null,null,null,null,null,null,null,null,null,null,null,null,null,null,null,null,null,null,null,null,null,null,null,null,null,null,null,null,null,null,null,null,null,null,null,null,null,null,null,null,null,null,"PAZ DE RIO"]
[null,null,null,null,null,null,null,null,null,null,null,null,null,null,null,null,null,null,null,null,null,null,null,null,null,null,null,null,null,null,null,null,null,null,null,null,null,null,null,null,null,null,null,null,null,null,null,null,null,null,null,null,null,null,null,null,null,null,null,null,null,null,null,null,null,null,null,null,null,null,"PESCA"]
[null,null,null,null,null,null,null,null,null,null,null,null,null,null,null,null,null,null,null,null,null,null,null,null,null,null,null,null,null,null,null,null,null,null,null,null,null,null,null,null,null,null,null,null,null,null,null,null,null,null,null,null,null,null,null,null,null,null,null,null,null,null,null,null,null,null,null,null,null,null,"PISBA"]
[null,null,null,null,null,null,null,null,null,null,null,null,null,null,null,null,null,null,null,null,null,null,null,null,null,null,null,null,null,null,null,null,null,null,null,null,null,null,null,null,null,null,null,null,null,null,null,null,null,null,null,null,null,null,null,null,null,null,null,null,null,null,null,null,null,null,null,null,null,null,"PUERTO BOYACA"]
[null,null,null,null,null,null,null,null,null,null,null,null,null,null,null,null,null,null,null,null,null,null,null,null,null,null,null,null,null,null,null,null,null,null,null,null,null,null,null,null,null,null,null,null,null,null,null,null,null,null,null,null,null,null,null,null,null,null,null,null,null,null,null,null,null,null,null,null,null,null,"QUIPAMA"]
[null,null,null,null,null,null,null,null,null,null,null,null,null,null,null,null,null,null,null,null,null,null,null,null,null,null,null,null,null,null,null,null,null,null,null,null,null,null,null,null,null,null,null,null,null,null,null,null,null,null,null,null,null,null,null,null,null,null,null,null,null,null,null,null,null,null,null,null,null,null,"RAMIRIQUI"]
[null,null,null,null,null,null,null,null,null,null,null,null,null,null,null,null,null,null,null,null,null,null,null,null,null,null,null,null,null,null,null,null,null,null,null,null,null,null,null,null,null,null,null,null,null,null,null,null,null,null,null,null,null,null,null,null,null,null,null,null,null,null,null,null,null,null,null,null,null,null,"RAQUIRA"]
[null,null,null,null,null,null,null,null,null,null,null,null,null,null,null,null,null,null,null,null,null,null,null,null,null,null,null,null,null,null,null,null,null,null,null,null,null,null,null,null,null,null,null,null,null,null,null,null,null,null,null,null,null,null,null,null,null,null,null,null,null,null,null,null,null,null,null,null,null,null,"RONDON"]
[null,null,null,null,null,null,null,null,null,null,null,null,null,null,null,null,null,null,null,null,null,null,null,null,null,null,null,null,null,null,null,null,null,null,null,null,null,null,null,null,null,null,null,null,null,null,null,null,null,null,null,null,null,null,null,null,null,null,null,null,null,null,null,null,null,null,null,null,null,null,"SABOYA"]
[null,null,null,null,null,null,null,null,null,null,null,null,null,null,null,null,null,null,null,null,null,null,null,null,null,null,null,null,null,null,null,null,null,null,null,null,null,null,null,null,null,null,null,null,null,null,null,null,null,null,null,null,null,null,null,null,null,null,null,null,null,null,null,null,null,null,null,null,null,null,"SACHICA"]
[null,null,null,null,null,null,null,null,null,null,null,null,null,null,null,null,null,null,null,null,null,null,null,null,null,null,null,null,null,null,null,null,null,null,null,null,null,null,null,null,null,null,null,null,null,null,null,null,null,null,null,null,null,null,null,null,null,null,null,null,null,null,null,null,null,null,null,null,null,null,"SAMACA"]
[null,null,null,null,null,null,null,null,null,null,null,null,null,null,null,null,null,null,null,null,null,null,null,null,null,null,null,null,null,null,null,null,null,null,null,null,null,null,null,null,null,null,null,null,null,null,null,null,null,null,null,null,null,null,null,null,null,null,null,null,null,null,null,null,null,null,null,null,null,null,"SAN EDUARDO"]
[null,null,null,null,null,null,null,null,null,null,null,null,null,null,null,null,null,null,null,null,null,null,null,null,null,null,null,null,null,null,null,null,null,null,null,null,null,null,null,null,null,null,null,null,null,null,null,null,null,null,null,null,null,null,null,null,null,null,null,null,null,null,null,null,null,null,null,null,null,null,"SAN JOSE DE PARE"]
[null,null,null,null,null,null,null,null,null,null,null,null,null,null,null,null,null,null,null,null,null,null,null,null,null,null,null,null,null,null,null,null,null,null,null,null,null,null,null,null,null,null,null,null,null,null,null,null,null,null,null,null,null,null,null,null,null,null,null,null,null,null,null,null,null,null,null,null,null,null,"SAN LUIS DE GACENO"]
[null,null,null,null,null,null,null,null,null,null,null,null,null,null,null,null,null,null,null,null,null,null,null,null,null,null,null,null,null,null,null,null,null,null,null,null,null,null,null,null,null,null,null,null,null,null,null,null,null,null,null,null,null,null,null,null,null,null,null,null,null,null,null,null,null,null,null,null,null,null,"SAN MATEO"]
[null,null,null,null,null,null,null,null,null,null,null,null,null,null,null,null,null,null,null,null,null,null,null,null,null,null,null,null,null,null,null,null,null,null,null,null,null,null,null,null,null,null,null,null,null,null,null,null,null,null,null,null,null,null,null,null,null,null,null,null,null,null,null,null,null,null,null,null,null,null,"SAN MIGUEL DE SEMA"]
[null,null,null,null,null,null,null,null,null,null,null,null,null,null,null,null,null,null,null,null,null,null,null,null,null,null,null,null,null,null,null,null,null,null,null,null,null,null,null,null,null,null,null,null,null,null,null,null,null,null,null,null,null,null,null,null,null,null,null,null,null,null,null,null,null,null,null,null,null,null,"SAN PABLO DE BORBUR"]
[null,null,null,null,null,null,null,null,null,null,null,null,null,null,null,null,null,null,null,null,null,null,null,null,null,null,null,null,null,null,null,null,null,null,null,null,null,null,null,null,null,null,null,null,null,null,null,null,null,null,null,null,null,null,null,null,null,null,null,null,null,null,null,null,null,null,null,null,null,null,"SANTA MARIA"]
[null,null,null,null,null,null,null,null,null,null,null,null,null,null,null,null,null,null,null,null,null,null,null,null,null,null,null,null,null,null,null,null,null,null,null,null,null,null,null,null,null,null,null,null,null,null,null,null,null,null,null,null,null,null,null,null,null,null,null,null,null,null,null,null,null,null,null,null,null,null,"SANTA ROSA DE VITERBO"]
[null,null,null,null,null,null,null,null,null,null,null,null,null,null,null,null,null,null,null,null,null,null,null,null,null,null,null,null,null,null,null,null,null,null,null,null,null,null,null,null,null,null,null,null,null,null,null,null,null,null,null,null,null,null,null,null,null,null,null,null,null,null,null,null,null,null,null,null,null,null,"SANTA SOFIA"]
[null,null,null,null,null,null,null,null,null,null,null,null,null,null,null,null,null,null,null,null,null,null,null,null,null,null,null,null,null,null,null,null,null,null,null,null,null,null,null,null,null,null,null,null,null,null,null,null,null,null,null,null,null,null,null,null,null,null,null,null,null,null,null,null,null,null,null,null,null,null,"SANTANA"]
[null,null,null,null,null,null,null,null,null,null,null,null,null,null,null,null,null,null,null,null,null,null,null,null,null,null,null,null,null,null,null,null,null,null,null,null,null,null,null,null,null,null,null,null,null,null,null,null,null,null,null,null,null,null,null,null,null,null,null,null,null,null,null,null,null,null,null,null,null,null,"SATIVANORTE"]
[null,null,null,null,null,null,null,null,null,null,null,null,null,null,null,null,null,null,null,null,null,null,null,null,null,null,null,null,null,null,null,null,null,null,null,null,null,null,null,null,null,null,null,null,null,null,null,null,null,null,null,null,null,null,null,null,null,null,null,null,null,null,null,null,null,null,null,null,null,null,"SATIVASUR"]
[null,null,null,null,null,null,null,null,null,null,null,null,null,null,null,null,null,null,null,null,null,null,null,null,null,null,null,null,null,null,null,null,null,null,null,null,null,null,null,null,null,null,null,null,null,null,null,null,null,null,null,null,null,null,null,null,null,null,null,null,null,null,null,null,null,null,null,null,null,null,"SIACHOQUE"]
[null,null,null,null,null,null,null,null,null,null,null,null,null,null,null,null,null,null,null,null,null,null,null,null,null,null,null,null,null,null,null,null,null,null,null,null,null,null,null,null,null,null,null,null,null,null,null,null,null,null,null,null,null,null,null,null,null,null,null,null,null,null,null,null,null,null,null,null,null,null,"SOATA"]
[null,null,null,null,null,null,null,null,null,null,null,null,null,null,null,null,null,null,null,null,null,null,null,null,null,null,null,null,null,null,null,null,null,null,null,null,null,null,null,null,null,null,null,null,null,null,null,null,null,null,null,null,null,null,null,null,null,null,null,null,null,null,null,null,null,null,null,null,null,null,"SOCHA"]
[null,null,null,null,null,null,null,null,null,null,null,null,null,null,null,null,null,null,null,null,null,null,null,null,null,null,null,null,null,null,null,null,null,null,null,null,null,null,null,null,null,null,null,null,null,null,null,null,null,null,null,null,null,null,null,null,null,null,null,null,null,null,null,null,null,null,null,null,null,null,"SOCOTA"]
[null,null,null,null,null,null,null,null,null,null,null,null,null,null,null,null,null,null,null,null,null,null,null,null,null,null,null,null,null,null,null,null,null,null,null,null,null,null,null,null,null,null,null,null,null,null,null,null,null,null,null,null,null,null,null,null,null,null,null,null,null,null,null,null,null,null,null,null,null,null,"SOGAMOSO"]
[null,null,null,null,null,null,null,null,null,null,null,null,null,null,null,null,null,null,null,null,null,null,null,null,null,null,null,null,null,null,null,null,null,null,null,null,null,null,null,null,null,null,null,null,null,null,null,null,null,null,null,null,null,null,null,null,null,null,null,null,null,null,null,null,null,null,null,null,null,null,"SOMONDOCO"]
[null,null,null,null,null,null,null,null,null,null,null,null,null,null,null,null,null,null,null,null,null,null,null,null,null,null,null,null,null,null,null,null,null,null,null,null,null,null,null,null,null,null,null,null,null,null,null,null,null,null,null,null,null,null,null,null,null,null,null,null,null,null,null,null,null,null,null,null,null,null,"SORA"]
[null,null,null,null,null,null,null,null,null,null,null,null,null,null,null,null,null,null,null,null,null,null,null,null,null,null,null,null,null,null,null,null,null,null,null,null,null,null,null,null,null,null,null,null,null,null,null,null,null,null,null,null,null,null,null,null,null,null,null,null,null,null,null,null,null,null,null,null,null,null,"SORACA"]
[null,null,null,null,null,null,null,null,null,null,null,null,null,null,null,null,null,null,null,null,null,null,null,null,null,null,null,null,null,null,null,null,null,null,null,null,null,null,null,null,null,null,null,null,null,null,null,null,null,null,null,null,null,null,null,null,null,null,null,null,null,null,null,null,null,null,null,null,null,null,"SOTAQUIRA"]
[null,null,null,null,null,null,null,null,null,null,null,null,null,null,null,null,null,null,null,null,null,null,null,null,null,null,null,null,null,null,null,null,null,null,null,null,null,null,null,null,null,null,null,null,null,null,null,null,null,null,null,null,null,null,null,null,null,null,null,null,null,null,null,null,null,null,null,null,null,null,"SUSACON"]
[null,null,null,null,null,null,null,null,null,null,null,null,null,null,null,null,null,null,null,null,null,null,null,null,null,null,null,null,null,null,null,null,null,null,null,null,null,null,null,null,null,null,null,null,null,null,null,null,null,null,null,null,null,null,null,null,null,null,null,null,null,null,null,null,null,null,null,null,null,null,"SUTAMARCHAN"]
[null,null,null,null,null,null,null,null,null,null,null,null,null,null,null,null,null,null,null,null,null,null,null,null,null,null,null,null,null,null,null,null,null,null,null,null,null,null,null,null,null,null,null,null,null,null,null,null,null,null,null,null,null,null,null,null,null,null,null,null,null,null,null,null,null,null,null,null,null,null,"SUTATENZA"]
[null,null,null,null,null,null,null,null,null,null,null,null,null,null,null,null,null,null,null,null,null,null,null,null,null,null,null,null,null,null,null,null,null,null,null,null,null,null,null,null,null,null,null,null,null,null,null,null,null,null,null,null,null,null,null,null,null,null,null,null,null,null,null,null,null,null,null,null,null,null,"TASCO"]
[null,null,null,null,null,null,null,null,null,null,null,null,null,null,null,null,null,null,null,null,null,null,null,null,null,null,null,null,null,null,null,null,null,null,null,null,null,null,null,null,null,null,null,null,null,null,null,null,null,null,null,null,null,null,null,null,null,null,null,null,null,null,null,null,null,null,null,null,null,null,"TENZA"]
[null,null,null,null,null,null,null,null,null,null,null,null,null,null,null,null,null,null,null,null,null,null,null,null,null,null,null,null,null,null,null,null,null,null,null,null,null,null,null,null,null,null,null,null,null,null,null,null,null,null,null,null,null,null,null,null,null,null,null,null,null,null,null,null,null,null,null,null,null,null,"TIBANA"]
[null,null,null,null,null,null,null,null,null,null,null,null,null,null,null,null,null,null,null,null,null,null,null,null,null,null,null,null,null,null,null,null,null,null,null,null,null,null,null,null,null,null,null,null,null,null,null,null,null,null,null,null,null,null,null,null,null,null,null,null,null,null,null,null,null,null,null,null,null,null,"TIBASOSA"]
[null,null,null,null,null,null,null,null,null,null,null,null,null,null,null,null,null,null,null,null,null,null,null,null,null,null,null,null,null,null,null,null,null,null,null,null,null,null,null,null,null,null,null,null,null,null,null,null,null,null,null,null,null,null,null,null,null,null,null,null,null,null,null,null,null,null,null,null,null,null,"TINJACA"]
[null,null,null,null,null,null,null,null,null,null,null,null,null,null,null,null,null,null,null,null,null,null,null,null,null,null,null,null,null,null,null,null,null,null,null,null,null,null,null,null,null,null,null,null,null,null,null,null,null,null,null,null,null,null,null,null,null,null,null,null,null,null,null,null,null,null,null,null,null,null,"TIPACOQUE"]
[null,null,null,null,null,null,null,null,null,null,null,null,null,null,null,null,null,null,null,null,null,null,null,null,null,null,null,null,null,null,null,null,null,null,null,null,null,null,null,null,null,null,null,null,null,null,null,null,null,null,null,null,null,null,null,null,null,null,null,null,null,null,null,null,null,null,null,null,null,null,"TOCA"]
[null,null,null,null,null,null,null,null,null,null,null,null,null,null,null,null,null,null,null,null,null,null,null,null,null,null,null,null,null,null,null,null,null,null,null,null,null,null,null,null,null,null,null,null,null,null,null,null,null,null,null,null,null,null,null,null,null,null,null,null,null,null,null,null,null,null,null,null,null,null,"TOGsI"]
[null,null,null,null,null,null,null,null,null,null,null,null,null,null,null,null,null,null,null,null,null,null,null,null,null,null,null,null,null,null,null,null,null,null,null,null,null,null,null,null,null,null,null,null,null,null,null,null,null,null,null,null,null,null,null,null,null,null,null,null,null,null,null,null,null,null,null,null,null,null,"TOPAGA"]
[null,null,null,null,null,null,null,null,null,null,null,null,null,null,null,null,null,null,null,null,null,null,null,null,null,null,null,null,null,null,null,null,null,null,null,null,null,null,null,null,null,null,null,null,null,null,null,null,null,null,null,null,null,null,null,null,null,null,null,null,null,null,null,null,null,null,null,null,null,null,"TOTA"]
[null,null,null,null,null,null,null,null,null,null,null,null,null,null,null,null,null,null,null,null,null,null,null,null,null,null,null,null,null,null,null,null,null,null,null,null,null,null,null,null,null,null,null,null,null,null,null,null,null,null,null,null,null,null,null,null,null,null,null,null,null,null,null,null,null,null,null,null,null,null,"TUNJA"]
[null,null,null,null,null,null,null,null,null,null,null,null,null,null,null,null,null,null,null,null,null,null,null,null,null,null,null,null,null,null,null,null,null,null,null,null,null,null,null,null,null,null,null,null,null,null,null,null,null,null,null,null,null,null,null,null,null,null,null,null,null,null,null,null,null,null,null,null,null,null,"TUNUNGUA"]
[null,null,null,null,null,null,null,null,null,null,null,null,null,null,null,null,null,null,null,null,null,null,null,null,null,null,null,null,null,null,null,null,null,null,null,null,null,null,null,null,null,null,null,null,null,null,null,null,null,null,null,null,null,null,null,null,null,null,null,null,null,null,null,null,null,null,null,null,null,null,"TURMEQUE"]
[null,null,null,null,null,null,null,null,null,null,null,null,null,null,null,null,null,null,null,null,null,null,null,null,null,null,null,null,null,null,null,null,null,null,null,null,null,null,null,null,null,null,null,null,null,null,null,null,null,null,null,null,null,null,null,null,null,null,null,null,null,null,null,null,null,null,null,null,null,null,"TUTA"]
[null,null,null,null,null,null,null,null,null,null,null,null,null,null,null,null,null,null,null,null,null,null,null,null,null,null,null,null,null,null,null,null,null,null,null,null,null,null,null,null,null,null,null,null,null,null,null,null,null,null,null,null,null,null,null,null,null,null,null,null,null,null,null,null,null,null,null,null,null,null,"TUTAZA"]
[null,null,null,null,null,null,null,null,null,null,null,null,null,null,null,null,null,null,null,null,null,null,null,null,null,null,null,null,null,null,null,null,null,null,null,null,null,null,null,null,null,null,null,null,null,null,null,null,null,null,null,null,null,null,null,null,null,null,null,null,null,null,null,null,null,null,null,null,null,null,"UMBITA"]
[null,null,null,null,null,null,null,null,null,null,null,null,null,null,null,null,null,null,null,null,null,null,null,null,null,null,null,null,null,null,null,null,null,null,null,null,null,null,null,null,null,null,null,null,null,null,null,null,null,null,null,null,null,null,null,null,null,null,null,null,null,null,null,null,null,null,null,null,null,null,"VENTAQUEMADA"]
[null,null,null,null,null,null,null,null,null,null,null,null,null,null,null,null,null,null,null,null,null,null,null,null,null,null,null,null,null,null,null,null,null,null,null,null,null,null,null,null,null,null,null,null,null,null,null,null,null,null,null,null,null,null,null,null,null,null,null,null,null,null,null,null,null,null,null,null,null,null,"VILLA DE LEYVA"]
[null,null,null,null,null,null,null,null,null,null,null,null,null,null,null,null,null,null,null,null,null,null,null,null,null,null,null,null,null,null,null,null,null,null,null,null,null,null,null,null,null,null,null,null,null,null,null,null,null,null,null,null,null,null,null,null,null,null,null,null,null,null,null,null,null,null,null,null,null,null,"VIRACACHA"]
[null,null,null,null,null,null,null,null,null,null,null,null,null,null,null,null,null,null,null,null,null,null,null,null,null,null,null,null,null,null,null,null,null,null,null,null,null,null,null,null,null,null,null,null,null,null,null,null,null,null,null,null,null,null,null,null,null,null,null,null,null,null,null,null,null,null,null,null,null,null,"ZETAQUIRA"]
[null,null,null,null,null,null,null,null,null,null,null,null,null,null,null,null,null,null,null,null,null,null,null,null,null,null,null,null,null,null,null,null,null,null,null,null,null,null,null,null,null,null,null,null,null,null,null,null,null,null,null,null,null,null,null,null,null,null,null,null,null,null,null,null,null,null,null,null,null,null,"AGUADAS"]
[null,null,null,null,null,null,null,null,null,null,null,null,null,null,null,null,null,null,null,null,null,null,null,null,null,null,null,null,null,null,null,null,null,null,null,null,null,null,null,null,null,null,null,null,null,null,null,null,null,null,null,null,null,null,null,null,null,null,null,null,null,null,null,null,null,null,null,null,null,null,"ANSERMA"]
[null,null,null,null,null,null,null,null,null,null,null,null,null,null,null,null,null,null,null,null,null,null,null,null,null,null,null,null,null,null,null,null,null,null,null,null,null,null,null,null,null,null,null,null,null,null,null,null,null,null,null,null,null,null,null,null,null,null,null,null,null,null,null,null,null,null,null,null,null,null,"ARANZAZU"]
[null,null,null,null,null,null,null,null,null,null,null,null,null,null,null,null,null,null,null,null,null,null,null,null,null,null,null,null,null,null,null,null,null,null,null,null,null,null,null,null,null,null,null,null,null,null,null,null,null,null,null,null,null,null,null,null,null,null,null,null,null,null,null,null,null,null,null,null,null,null,"BELALCAZAR"]
[null,null,null,null,null,null,null,null,null,null,null,null,null,null,null,null,null,null,null,null,null,null,null,null,null,null,null,null,null,null,null,null,null,null,null,null,null,null,null,null,null,null,null,null,null,null,null,null,null,null,null,null,null,null,null,null,null,null,null,null,null,null,null,null,null,null,null,null,null,null,"CHINCHINA"]
[null,null,null,null,null,null,null,null,null,null,null,null,null,null,null,null,null,null,null,null,null,null,null,null,null,null,null,null,null,null,null,null,null,null,null,null,null,null,null,null,null,null,null,null,null,null,null,null,null,null,null,null,null,null,null,null,null,null,null,null,null,null,null,null,null,null,null,null,null,null,"FILADELFIA"]
[null,null,null,null,null,null,null,null,null,null,null,null,null,null,null,null,null,null,null,null,null,null,null,null,null,null,null,null,null,null,null,null,null,null,null,null,null,null,null,null,null,null,null,null,null,null,null,null,null,null,null,null,null,null,null,null,null,null,null,null,null,null,null,null,null,null,null,null,null,null,"LA DORADA"]
[null,null,null,null,null,null,null,null,null,null,null,null,null,null,null,null,null,null,null,null,null,null,null,null,null,null,null,null,null,null,null,null,null,null,null,null,null,null,null,null,null,null,null,null,null,null,null,null,null,null,null,null,null,null,null,null,null,null,null,null,null,null,null,null,null,null,null,null,null,null,"LA MERCED"]
[null,null,null,null,null,null,null,null,null,null,null,null,null,null,null,null,null,null,null,null,null,null,null,null,null,null,null,null,null,null,null,null,null,null,null,null,null,null,null,null,null,null,null,null,null,null,null,null,null,null,null,null,null,null,null,null,null,null,null,null,null,null,null,null,null,null,null,null,null,null,"MANIZALES"]
[null,null,null,null,null,null,null,null,null,null,null,null,null,null,null,null,null,null,null,null,null,null,null,null,null,null,null,null,null,null,null,null,null,null,null,null,null,null,null,null,null,null,null,null,null,null,null,null,null,null,null,null,null,null,null,null,null,null,null,null,null,null,null,null,null,null,null,null,null,null,"MANZANARES"]
[null,null,null,null,null,null,null,null,null,null,null,null,null,null,null,null,null,null,null,null,null,null,null,null,null,null,null,null,null,null,null,null,null,null,null,null,null,null,null,null,null,null,null,null,null,null,null,null,null,null,null,null,null,null,null,null,null,null,null,null,null,null,null,null,null,null,null,null,null,null,"MARMATO"]
[null,null,null,null,null,null,null,null,null,null,null,null,null,null,null,null,null,null,null,null,null,null,null,null,null,null,null,null,null,null,null,null,null,null,null,null,null,null,null,null,null,null,null,null,null,null,null,null,null,null,null,null,null,null,null,null,null,null,null,null,null,null,null,null,null,null,null,null,null,null,"MARQUETALIA"]
[null,null,null,null,null,null,null,null,null,null,null,null,null,null,null,null,null,null,null,null,null,null,null,null,null,null,null,null,null,null,null,null,null,null,null,null,null,null,null,null,null,null,null,null,null,null,null,null,null,null,null,null,null,null,null,null,null,null,null,null,null,null,null,null,null,null,null,null,null,null,"MARULANDA"]
[null,null,null,null,null,null,null,null,null,null,null,null,null,null,null,null,null,null,null,null,null,null,null,null,null,null,null,null,null,null,null,null,null,null,null,null,null,null,null,null,null,null,null,null,null,null,null,null,null,null,null,null,null,null,null,null,null,null,null,null,null,null,null,null,null,null,null,null,null,null,"NEIRA"]
[null,null,null,null,null,null,null,null,null,null,null,null,null,null,null,null,null,null,null,null,null,null,null,null,null,null,null,null,null,null,null,null,null,null,null,null,null,null,null,null,null,null,null,null,null,null,null,null,null,null,null,null,null,null,null,null,null,null,null,null,null,null,null,null,null,null,null,null,null,null,"NORCASIA"]
[null,null,null,null,null,null,null,null,null,null,null,null,null,null,null,null,null,null,null,null,null,null,null,null,null,null,null,null,null,null,null,null,null,null,null,null,null,null,null,null,null,null,null,null,null,null,null,null,null,null,null,null,null,null,null,null,null,null,null,null,null,null,null,null,null,null,null,null,null,null,"PACORA"]
[null,null,null,null,null,null,null,null,null,null,null,null,null,null,null,null,null,null,null,null,null,null,null,null,null,null,null,null,null,null,null,null,null,null,null,null,null,null,null,null,null,null,null,null,null,null,null,null,null,null,null,null,null,null,null,null,null,null,null,null,null,null,null,null,null,null,null,null,null,null,"PALESTINA"]
[null,null,null,null,null,null,null,null,null,null,null,null,null,null,null,null,null,null,null,null,null,null,null,null,null,null,null,null,null,null,null,null,null,null,null,null,null,null,null,null,null,null,null,null,null,null,null,null,null,null,null,null,null,null,null,null,null,null,null,null,null,null,null,null,null,null,null,null,null,null,"PENSILVANIA"]
[null,null,null,null,null,null,null,null,null,null,null,null,null,null,null,null,null,null,null,null,null,null,null,null,null,null,null,null,null,null,null,null,null,null,null,null,null,null,null,null,null,null,null,null,null,null,null,null,null,null,null,null,null,null,null,null,null,null,null,null,null,null,null,null,null,null,null,null,null,null,"RIOSUCIO"]
[null,null,null,null,null,null,null,null,null,null,null,null,null,null,null,null,null,null,null,null,null,null,null,null,null,null,null,null,null,null,null,null,null,null,null,null,null,null,null,null,null,null,null,null,null,null,null,null,null,null,null,null,null,null,null,null,null,null,null,null,null,null,null,null,null,null,null,null,null,null,"RISARALDA"]
[null,null,null,null,null,null,null,null,null,null,null,null,null,null,null,null,null,null,null,null,null,null,null,null,null,null,null,null,null,null,null,null,null,null,null,null,null,null,null,null,null,null,null,null,null,null,null,null,null,null,null,null,null,null,null,null,null,null,null,null,null,null,null,null,null,null,null,null,null,null,"SALAMINA"]
[null,null,null,null,null,null,null,null,null,null,null,null,null,null,null,null,null,null,null,null,null,null,null,null,null,null,null,null,null,null,null,null,null,null,null,null,null,null,null,null,null,null,null,null,null,null,null,null,null,null,null,null,null,null,null,null,null,null,null,null,null,null,null,null,null,null,null,null,null,null,"SAMANA"]
[null,null,null,null,null,null,null,null,null,null,null,null,null,null,null,null,null,null,null,null,null,null,null,null,null,null,null,null,null,null,null,null,null,null,null,null,null,null,null,null,null,null,null,null,null,null,null,null,null,null,null,null,null,null,null,null,null,null,null,null,null,null,null,null,null,null,null,null,null,null,"SAN JOSE"]
[null,null,null,null,null,null,null,null,null,null,null,null,null,null,null,null,null,null,null,null,null,null,null,null,null,null,null,null,null,null,null,null,null,null,null,null,null,null,null,null,null,null,null,null,null,null,null,null,null,null,null,null,null,null,null,null,null,null,null,null,null,null,null,null,null,null,null,null,null,null,"SUPIA"]
[null,null,null,null,null,null,null,null,null,null,null,null,null,null,null,null,null,null,null,null,null,null,null,null,null,null,null,null,null,null,null,null,null,null,null,null,null,null,null,null,null,null,null,null,null,null,null,null,null,null,null,null,null,null,null,null,null,null,null,null,null,null,null,null,null,null,null,null,null,null,"VICTORIA"]
[null,null,null,null,null,null,null,null,null,null,null,null,null,null,null,null,null,null,null,null,null,null,null,null,null,null,null,null,null,null,null,null,null,null,null,null,null,null,null,null,null,null,null,null,null,null,null,null,null,null,null,null,null,null,null,null,null,null,null,null,null,null,null,null,null,null,null,null,null,null,"VILLAMARIA"]
[null,null,null,null,null,null,null,null,null,null,null,null,null,null,null,null,null,null,null,null,null,null,null,null,null,null,null,null,null,null,null,null,null,null,null,null,null,null,null,null,null,null,null,null,null,null,null,null,null,null,null,null,null,null,null,null,null,null,null,null,null,null,null,null,null,null,null,null,null,null,"VITERBO"]
[null,null,null,null,null,null,null,null,null,null,null,null,null,null,null,null,null,null,null,null,null,null,null,null,null,null,null,null,null,null,null,null,null,null,null,null,null,null,null,null,null,null,null,null,null,null,null,null,null,null,null,null,null,null,null,null,null,null,null,null,null,null,null,null,null,null,null,null,null,null,"ALBANIA"]
[null,null,null,null,null,null,null,null,null,null,null,null,null,null,null,null,null,null,null,null,null,null,null,null,null,null,null,null,null,null,null,null,null,null,null,null,null,null,null,null,null,null,null,null,null,null,null,null,null,null,null,null,null,null,null,null,null,null,null,null,null,null,null,null,null,null,null,null,null,null,"BELEN DE LOS ANDAQUIES"]
[null,null,null,null,null,null,null,null,null,null,null,null,null,null,null,null,null,null,null,null,null,null,null,null,null,null,null,null,null,null,null,null,null,null,null,null,null,null,null,null,null,null,null,null,null,null,null,null,null,null,null,null,null,null,null,null,null,null,null,null,null,null,null,null,null,null,null,null,null,null,"CARTAGENA DEL CHAIRA"]
[null,null,null,null,null,null,null,null,null,null,null,null,null,null,null,null,null,null,null,null,null,null,null,null,null,null,null,null,null,null,null,null,null,null,null,null,null,null,null,null,null,null,null,null,null,null,null,null,null,null,null,null,null,null,null,null,null,null,null,null,null,null,null,null,null,null,null,null,null,null,"CURILLO"]
[null,null,null,null,null,null,null,null,null,null,null,null,null,null,null,null,null,null,null,null,null,null,null,null,null,null,null,null,null,null,null,null,null,null,null,null,null,null,null,null,null,null,null,null,null,null,null,null,null,null,null,null,null,null,null,null,null,null,null,null,null,null,null,null,null,null,null,null,null,null,"EL DONCELLO"]
[null,null,null,null,null,null,null,null,null,null,null,null,null,null,null,null,null,null,null,null,null,null,null,null,null,null,null,null,null,null,null,null,null,null,null,null,null,null,null,null,null,null,null,null,null,null,null,null,null,null,null,null,null,null,null,null,null,null,null,null,null,null,null,null,null,null,null,null,null,null,"EL PAUJIL"]
[null,null,null,null,null,null,null,null,null,null,null,null,null,null,null,null,null,null,null,null,null,null,null,null,null,null,null,null,null,null,null,null,null,null,null,null,null,null,null,null,null,null,null,null,null,null,null,null,null,null,null,null,null,null,null,null,null,null,null,null,null,null,null,null,null,null,null,null,null,null,"FLORENCIA"]
[null,null,null,null,null,null,null,null,null,null,null,null,null,null,null,null,null,null,null,null,null,null,null,null,null,null,null,null,null,null,null,null,null,null,null,null,null,null,null,null,null,null,null,null,null,null,null,null,null,null,null,null,null,null,null,null,null,null,null,null,null,null,null,null,null,null,null,null,null,null,"LA MONTAÑITA"]
[null,null,null,null,null,null,null,null,null,null,null,null,null,null,null,null,null,null,null,null,null,null,null,null,null,null,null,null,null,null,null,null,null,null,null,null,null,null,null,null,null,null,null,null,null,null,null,null,null,null,null,null,null,null,null,null,null,null,null,null,null,null,null,null,null,null,null,null,null,null,"MILAN"]
[null,null,null,null,null,null,null,null,null,null,null,null,null,null,null,null,null,null,null,null,null,null,null,null,null,null,null,null,null,null,null,null,null,null,null,null,null,null,null,null,null,null,null,null,null,null,null,null,null,null,null,null,null,null,null,null,null,null,null,null,null,null,null,null,null,null,null,null,null,null,"MORELIA"]
[null,null,null,null,null,null,null,null,null,null,null,null,null,null,null,null,null,null,null,null,null,null,null,null,null,null,null,null,null,null,null,null,null,null,null,null,null,null,null,null,null,null,null,null,null,null,null,null,null,null,null,null,null,null,null,null,null,null,null,null,null,null,null,null,null,null,null,null,null,null,"PUERTO RICO"]
[null,null,null,null,null,null,null,null,null,null,null,null,null,null,null,null,null,null,null,null,null,null,null,null,null,null,null,null,null,null,null,null,null,null,null,null,null,null,null,null,null,null,null,null,null,null,null,null,null,null,null,null,null,null,null,null,null,null,null,null,null,null,null,null,null,null,null,null,null,null,"SAN JOSE DEL FRAGUA"]
[null,null,null,null,null,null,null,null,null,null,null,null,null,null,null,null,null,null,null,null,null,null,null,null,null,null,null,null,null,null,null,null,null,null,null,null,null,null,null,null,null,null,null,null,null,null,null,null,null,null,null,null,null,null,null,null,null,null,null,null,null,null,null,null,null,null,null,null,null,null,"SAN VICENTE DEL CAGUAN"]
[null,null,null,null,null,null,null,null,null,null,null,null,null,null,null,null,null,null,null,null,null,null,null,null,null,null,null,null,null,null,null,null,null,null,null,null,null,null,null,null,null,null,null,null,null,null,null,null,null,null,null,null,null,null,null,null,null,null,null,null,null,null,null,null,null,null,null,null,null,null,"SOLANO"]
[null,null,null,null,null,null,null,null,null,null,null,null,null,null,null,null,null,null,null,null,null,null,null,null,null,null,null,null,null,null,null,null,null,null,null,null,null,null,null,null,null,null,null,null,null,null,null,null,null,null,null,null,null,null,null,null,null,null,null,null,null,null,null,null,null,null,null,null,null,null,"SOLITA"]
[null,null,null,null,null,null,null,null,null,null,null,null,null,null,null,null,null,null,null,null,null,null,null,null,null,null,null,null,null,null,null,null,null,null,null,null,null,null,null,null,null,null,null,null,null,null,null,null,null,null,null,null,null,null,null,null,null,null,null,null,null,null,null,null,null,null,null,null,null,null,"VALPARAISO"]
[null,null,null,null,null,null,null,null,null,null,null,null,null,null,null,null,null,null,null,null,null,null,null,null,null,null,null,null,null,null,null,null,null,null,null,null,null,null,null,null,null,null,null,null,null,null,null,null,null,null,null,null,null,null,null,null,null,null,null,null,null,null,null,null,null,null,null,null,null,null,"AGUAZUL"]
[null,null,null,null,null,null,null,null,null,null,null,null,null,null,null,null,null,null,null,null,null,null,null,null,null,null,null,null,null,null,null,null,null,null,null,null,null,null,null,null,null,null,null,null,null,null,null,null,null,null,null,null,null,null,null,null,null,null,null,null,null,null,null,null,null,null,null,null,null,null,"CHAMEZA"]
[null,null,null,null,null,null,null,null,null,null,null,null,null,null,null,null,null,null,null,null,null,null,null,null,null,null,null,null,null,null,null,null,null,null,null,null,null,null,null,null,null,null,null,null,null,null,null,null,null,null,null,null,null,null,null,null,null,null,null,null,null,null,null,null,null,null,null,null,null,null,"HATO COROZAL"]
[null,null,null,null,null,null,null,null,null,null,null,null,null,null,null,null,null,null,null,null,null,null,null,null,null,null,null,null,null,null,null,null,null,null,null,null,null,null,null,null,null,null,null,null,null,null,null,null,null,null,null,null,null,null,null,null,null,null,null,null,null,null,null,null,null,null,null,null,null,null,"LA SALINA"]
[null,null,null,null,null,null,null,null,null,null,null,null,null,null,null,null,null,null,null,null,null,null,null,null,null,null,null,null,null,null,null,null,null,null,null,null,null,null,null,null,null,null,null,null,null,null,null,null,null,null,null,null,null,null,null,null,null,null,null,null,null,null,null,null,null,null,null,null,null,null,"MANI"]
[null,null,null,null,null,null,null,null,null,null,null,null,null,null,null,null,null,null,null,null,null,null,null,null,null,null,null,null,null,null,null,null,null,null,null,null,null,null,null,null,null,null,null,null,null,null,null,null,null,null,null,null,null,null,null,null,null,null,null,null,null,null,null,null,null,null,null,null,null,null,"MONTERREY"]
[null,null,null,null,null,null,null,null,null,null,null,null,null,null,null,null,null,null,null,null,null,null,null,null,null,null,null,null,null,null,null,null,null,null,null,null,null,null,null,null,null,null,null,null,null,null,null,null,null,null,null,null,null,null,null,null,null,null,null,null,null,null,null,null,null,null,null,null,null,null,"NUNCHIA"]
[null,null,null,null,null,null,null,null,null,null,null,null,null,null,null,null,null,null,null,null,null,null,null,null,null,null,null,null,null,null,null,null,null,null,null,null,null,null,null,null,null,null,null,null,null,null,null,null,null,null,null,null,null,null,null,null,null,null,null,null,null,null,null,null,null,null,null,null,null,null,"OROCUE"]
[null,null,null,null,null,null,null,null,null,null,null,null,null,null,null,null,null,null,null,null,null,null,null,null,null,null,null,null,null,null,null,null,null,null,null,null,null,null,null,null,null,null,null,null,null,null,null,null,null,null,null,null,null,null,null,null,null,null,null,null,null,null,null,null,null,null,null,null,null,null,"PAZ DE ARIPORO"]
[null,null,null,null,null,null,null,null,null,null,null,null,null,null,null,null,null,null,null,null,null,null,null,null,null,null,null,null,null,null,null,null,null,null,null,null,null,null,null,null,null,null,null,null,null,null,null,null,null,null,null,null,null,null,null,null,null,null,null,null,null,null,null,null,null,null,null,null,null,null,"PORE"]
[null,null,null,null,null,null,null,null,null,null,null,null,null,null,null,null,null,null,null,null,null,null,null,null,null,null,null,null,null,null,null,null,null,null,null,null,null,null,null,null,null,null,null,null,null,null,null,null,null,null,null,null,null,null,null,null,null,null,null,null,null,null,null,null,null,null,null,null,null,null,"RECETOR"]
[null,null,null,null,null,null,null,null,null,null,null,null,null,null,null,null,null,null,null,null,null,null,null,null,null,null,null,null,null,null,null,null,null,null,null,null,null,null,null,null,null,null,null,null,null,null,null,null,null,null,null,null,null,null,null,null,null,null,null,null,null,null,null,null,null,null,null,null,null,null,"SABANALARGA"]
[null,null,null,null,null,null,null,null,null,null,null,null,null,null,null,null,null,null,null,null,null,null,null,null,null,null,null,null,null,null,null,null,null,null,null,null,null,null,null,null,null,null,null,null,null,null,null,null,null,null,null,null,null,null,null,null,null,null,null,null,null,null,null,null,null,null,null,null,null,null,"SACAMA"]
[null,null,null,null,null,null,null,null,null,null,null,null,null,null,null,null,null,null,null,null,null,null,null,null,null,null,null,null,null,null,null,null,null,null,null,null,null,null,null,null,null,null,null,null,null,null,null,null,null,null,null,null,null,null,null,null,null,null,null,null,null,null,null,null,null,null,null,null,null,null,"SAN LUIS DE PALENQUE"]
[null,null,null,null,null,null,null,null,null,null,null,null,null,null,null,null,null,null,null,null,null,null,null,null,null,null,null,null,null,null,null,null,null,null,null,null,null,null,null,null,null,null,null,null,null,null,null,null,null,null,null,null,null,null,null,null,null,null,null,null,null,null,null,null,null,null,null,null,null,null,"TAMARA"]
[null,null,null,null,null,null,null,null,null,null,null,null,null,null,null,null,null,null,null,null,null,null,null,null,null,null,null,null,null,null,null,null,null,null,null,null,null,null,null,null,null,null,null,null,null,null,null,null,null,null,null,null,null,null,null,null,null,null,null,null,null,null,null,null,null,null,null,null,null,null,"TAURAMENA"]
[null,null,null,null,null,null,null,null,null,null,null,null,null,null,null,null,null,null,null,null,null,null,null,null,null,null,null,null,null,null,null,null,null,null,null,null,null,null,null,null,null,null,null,null,null,null,null,null,null,null,null,null,null,null,null,null,null,null,null,null,null,null,null,null,null,null,null,null,null,null,"TRINIDAD"]
[null,null,null,null,null,null,null,null,null,null,null,null,null,null,null,null,null,null,null,null,null,null,null,null,null,null,null,null,null,null,null,null,null,null,null,null,null,null,null,null,null,null,null,null,null,null,null,null,null,null,null,null,null,null,null,null,null,null,null,null,null,null,null,null,null,null,null,null,null,null,"VILLANUEVA"]
[null,null,null,null,null,null,null,null,null,null,null,null,null,null,null,null,null,null,null,null,null,null,null,null,null,null,null,null,null,null,null,null,null,null,null,null,null,null,null,null,null,null,null,null,null,null,null,null,null,null,null,null,null,null,null,null,null,null,null,null,null,null,null,null,null,null,null,null,null,null,"YOPAL"]
[null,null,null,null,null,null,null,null,null,null,null,null,null,null,null,null,null,null,null,null,null,null,null,null,null,null,null,null,null,null,null,null,null,null,null,null,null,null,null,null,null,null,null,null,null,null,null,null,null,null,null,null,null,null,null,null,null,null,null,null,null,null,null,null,null,null,null,null,null,null,"ALMAGUER"]
[null,null,null,null,null,null,null,null,null,null,null,null,null,null,null,null,null,null,null,null,null,null,null,null,null,null,null,null,null,null,null,null,null,null,null,null,null,null,null,null,null,null,null,null,null,null,null,null,null,null,null,null,null,null,null,null,null,null,null,null,null,null,null,null,null,null,null,null,null,null,"ARGELIA"]
[null,null,null,null,null,null,null,null,null,null,null,null,null,null,null,null,null,null,null,null,null,null,null,null,null,null,null,null,null,null,null,null,null,null,null,null,null,null,null,null,null,null,null,null,null,null,null,null,null,null,null,null,null,null,null,null,null,null,null,null,null,null,null,null,null,null,null,null,null,null,"BALBOA"]
[null,null,null,null,null,null,null,null,null,null,null,null,null,null,null,null,null,null,null,null,null,null,null,null,null,null,null,null,null,null,null,null,null,null,null,null,null,null,null,null,null,null,null,null,null,null,null,null,null,null,null,null,null,null,null,null,null,null,null,null,null,null,null,null,null,null,null,null,null,null,"BOLIVAR"]
[null,null,null,null,null,null,null,null,null,null,null,null,null,null,null,null,null,null,null,null,null,null,null,null,null,null,null,null,null,null,null,null,null,null,null,null,null,null,null,null,null,null,null,null,null,null,null,null,null,null,null,null,null,null,null,null,null,null,null,null,null,null,null,null,null,null,null,null,null,null,"BUENOS AIRES"]
[null,null,null,null,null,null,null,null,null,null,null,null,null,null,null,null,null,null,null,null,null,null,null,null,null,null,null,null,null,null,null,null,null,null,null,null,null,null,null,null,null,null,null,null,null,null,null,null,null,null,null,null,null,null,null,null,null,null,null,null,null,null,null,null,null,null,null,null,null,null,"CAJIBIO"]
[null,null,null,null,null,null,null,null,null,null,null,null,null,null,null,null,null,null,null,null,null,null,null,null,null,null,null,null,null,null,null,null,null,null,null,null,null,null,null,null,null,null,null,null,null,null,null,null,null,null,null,null,null,null,null,null,null,null,null,null,null,null,null,null,null,null,null,null,null,null,"CALDONO"]
[null,null,null,null,null,null,null,null,null,null,null,null,null,null,null,null,null,null,null,null,null,null,null,null,null,null,null,null,null,null,null,null,null,null,null,null,null,null,null,null,null,null,null,null,null,null,null,null,null,null,null,null,null,null,null,null,null,null,null,null,null,null,null,null,null,null,null,null,null,null,"CALOTO"]
[null,null,null,null,null,null,null,null,null,null,null,null,null,null,null,null,null,null,null,null,null,null,null,null,null,null,null,null,null,null,null,null,null,null,null,null,null,null,null,null,null,null,null,null,null,null,null,null,null,null,null,null,null,null,null,null,null,null,null,null,null,null,null,null,null,null,null,null,null,null,"CORINTO"]
[null,null,null,null,null,null,null,null,null,null,null,null,null,null,null,null,null,null,null,null,null,null,null,null,null,null,null,null,null,null,null,null,null,null,null,null,null,null,null,null,null,null,null,null,null,null,null,null,null,null,null,null,null,null,null,null,null,null,null,null,null,null,null,null,null,null,null,null,null,null,"EL TAMBO"]
[null,null,null,null,null,null,null,null,null,null,null,null,null,null,null,null,null,null,null,null,null,null,null,null,null,null,null,null,null,null,null,null,null,null,null,null,null,null,null,null,null,null,null,null,null,null,null,null,null,null,null,null,null,null,null,null,null,null,null,null,null,null,null,null,null,null,null,null,null,null,"FLORENCIA"]
[null,null,null,null,null,null,null,null,null,null,null,null,null,null,null,null,null,null,null,null,null,null,null,null,null,null,null,null,null,null,null,null,null,null,null,null,null,null,null,null,null,null,null,null,null,null,null,null,null,null,null,null,null,null,null,null,null,null,null,null,null,null,null,null,null,null,null,null,null,null,"GUACHENE"]
[null,null,null,null,null,null,null,null,null,null,null,null,null,null,null,null,null,null,null,null,null,null,null,null,null,null,null,null,null,null,null,null,null,null,null,null,null,null,null,null,null,null,null,null,null,null,null,null,null,null,null,null,null,null,null,null,null,null,null,null,null,null,null,null,null,null,null,null,null,null,"GUAPI"]
[null,null,null,null,null,null,null,null,null,null,null,null,null,null,null,null,null,null,null,null,null,null,null,null,null,null,null,null,null,null,null,null,null,null,null,null,null,null,null,null,null,null,null,null,null,null,null,null,null,null,null,null,null,null,null,null,null,null,null,null,null,null,null,null,null,null,null,null,null,null,"INZA"]
[null,null,null,null,null,null,null,null,null,null,null,null,null,null,null,null,null,null,null,null,null,null,null,null,null,null,null,null,null,null,null,null,null,null,null,null,null,null,null,null,null,null,null,null,null,null,null,null,null,null,null,null,null,null,null,null,null,null,null,null,null,null,null,null,null,null,null,null,null,null,"JAMBALO"]
[null,null,null,null,null,null,null,null,null,null,null,null,null,null,null,null,null,null,null,null,null,null,null,null,null,null,null,null,null,null,null,null,null,null,null,null,null,null,null,null,null,null,null,null,null,null,null,null,null,null,null,null,null,null,null,null,null,null,null,null,null,null,null,null,null,null,null,null,null,null,"LA SIERRA"]
[null,null,null,null,null,null,null,null,null,null,null,null,null,null,null,null,null,null,null,null,null,null,null,null,null,null,null,null,null,null,null,null,null,null,null,null,null,null,null,null,null,null,null,null,null,null,null,null,null,null,null,null,null,null,null,null,null,null,null,null,null,null,null,null,null,null,null,null,null,null,"LA VEGA"]
[null,null,null,null,null,null,null,null,null,null,null,null,null,null,null,null,null,null,null,null,null,null,null,null,null,null,null,null,null,null,null,null,null,null,null,null,null,null,null,null,null,null,null,null,null,null,null,null,null,null,null,null,null,null,null,null,null,null,null,null,null,null,null,null,null,null,null,null,null,null,"LOPEZ"]
[null,null,null,null,null,null,null,null,null,null,null,null,null,null,null,null,null,null,null,null,null,null,null,null,null,null,null,null,null,null,null,null,null,null,null,null,null,null,null,null,null,null,null,null,null,null,null,null,null,null,null,null,null,null,null,null,null,null,null,null,null,null,null,null,null,null,null,null,null,null,"MERCADERES"]
[null,null,null,null,null,null,null,null,null,null,null,null,null,null,null,null,null,null,null,null,null,null,null,null,null,null,null,null,null,null,null,null,null,null,null,null,null,null,null,null,null,null,null,null,null,null,null,null,null,null,null,null,null,null,null,null,null,null,null,null,null,null,null,null,null,null,null,null,null,null,"MIRANDA"]
[null,null,null,null,null,null,null,null,null,null,null,null,null,null,null,null,null,null,null,null,null,null,null,null,null,null,null,null,null,null,null,null,null,null,null,null,null,null,null,null,null,null,null,null,null,null,null,null,null,null,null,null,null,null,null,null,null,null,null,null,null,null,null,null,null,null,null,null,null,null,"MORALES"]
[null,null,null,null,null,null,null,null,null,null,null,null,null,null,null,null,null,null,null,null,null,null,null,null,null,null,null,null,null,null,null,null,null,null,null,null,null,null,null,null,null,null,null,null,null,null,null,null,null,null,null,null,null,null,null,null,null,null,null,null,null,null,null,null,null,null,null,null,null,null,"PADILLA"]
[null,null,null,null,null,null,null,null,null,null,null,null,null,null,null,null,null,null,null,null,null,null,null,null,null,null,null,null,null,null,null,null,null,null,null,null,null,null,null,null,null,null,null,null,null,null,null,null,null,null,null,null,null,null,null,null,null,null,null,null,null,null,null,null,null,null,null,null,null,null,"PAEZ"]
[null,null,null,null,null,null,null,null,null,null,null,null,null,null,null,null,null,null,null,null,null,null,null,null,null,null,null,null,null,null,null,null,null,null,null,null,null,null,null,null,null,null,null,null,null,null,null,null,null,null,null,null,null,null,null,null,null,null,null,null,null,null,null,null,null,null,null,null,null,null,"PATIA"]
[null,null,null,null,null,null,null,null,null,null,null,null,null,null,null,null,null,null,null,null,null,null,null,null,null,null,null,null,null,null,null,null,null,null,null,null,null,null,null,null,null,null,null,null,null,null,null,null,null,null,null,null,null,null,null,null,null,null,null,null,null,null,null,null,null,null,null,null,null,null,"PIAMONTE"]
[null,null,null,null,null,null,null,null,null,null,null,null,null,null,null,null,null,null,null,null,null,null,null,null,null,null,null,null,null,null,null,null,null,null,null,null,null,null,null,null,null,null,null,null,null,null,null,null,null,null,null,null,null,null,null,null,null,null,null,null,null,null,null,null,null,null,null,null,null,null,"PIENDAMO"]
[null,null,null,null,null,null,null,null,null,null,null,null,null,null,null,null,null,null,null,null,null,null,null,null,null,null,null,null,null,null,null,null,null,null,null,null,null,null,null,null,null,null,null,null,null,null,null,null,null,null,null,null,null,null,null,null,null,null,null,null,null,null,null,null,null,null,null,null,null,null,"POPAYAN"]
[null,null,null,null,null,null,null,null,null,null,null,null,null,null,null,null,null,null,null,null,null,null,null,null,null,null,null,null,null,null,null,null,null,null,null,null,null,null,null,null,null,null,null,null,null,null,null,null,null,null,null,null,null,null,null,null,null,null,null,null,null,null,null,null,null,null,null,null,null,null,"PUERTO TEJADA"]
[null,null,null,null,null,null,null,null,null,null,null,null,null,null,null,null,null,null,null,null,null,null,null,null,null,null,null,null,null,null,null,null,null,null,null,null,null,null,null,null,null,null,null,null,null,null,null,null,null,null,null,null,null,null,null,null,null,null,null,null,null,null,null,null,null,null,null,null,null,null,"PURACE"]
[null,null,null,null,null,null,null,null,null,null,null,null,null,null,null,null,null,null,null,null,null,null,null,null,null,null,null,null,null,null,null,null,null,null,null,null,null,null,null,null,null,null,null,null,null,null,null,null,null,null,null,null,null,null,null,null,null,null,null,null,null,null,null,null,null,null,null,null,null,null,"ROSAS"]
[null,null,null,null,null,null,null,null,null,null,null,null,null,null,null,null,null,null,null,null,null,null,null,null,null,null,null,null,null,null,null,null,null,null,null,null,null,null,null,null,null,null,null,null,null,null,null,null,null,null,null,null,null,null,null,null,null,null,null,null,null,null,null,null,null,null,null,null,null,null,"SAN SEBASTIAN"]
[null,null,null,null,null,null,null,null,null,null,null,null,null,null,null,null,null,null,null,null,null,null,null,null,null,null,null,null,null,null,null,null,null,null,null,null,null,null,null,null,null,null,null,null,null,null,null,null,null,null,null,null,null,null,null,null,null,null,null,null,null,null,null,null,null,null,null,null,null,null,"SANTA ROSA"]
[null,null,null,null,null,null,null,null,null,null,null,null,null,null,null,null,null,null,null,null,null,null,null,null,null,null,null,null,null,null,null,null,null,null,null,null,null,null,null,null,null,null,null,null,null,null,null,null,null,null,null,null,null,null,null,null,null,null,null,null,null,null,null,null,null,null,null,null,null,null,"SANTANDER DE QUILICHAO"]
[null,null,null,null,null,null,null,null,null,null,null,null,null,null,null,null,null,null,null,null,null,null,null,null,null,null,null,null,null,null,null,null,null,null,null,null,null,null,null,null,null,null,null,null,null,null,null,null,null,null,null,null,null,null,null,null,null,null,null,null,null,null,null,null,null,null,null,null,null,null,"SILVIA"]
[null,null,null,null,null,null,null,null,null,null,null,null,null,null,null,null,null,null,null,null,null,null,null,null,null,null,null,null,null,null,null,null,null,null,null,null,null,null,null,null,null,null,null,null,null,null,null,null,null,null,null,null,null,null,null,null,null,null,null,null,null,null,null,null,null,null,null,null,null,null,"SOTARA"]
[null,null,null,null,null,null,null,null,null,null,null,null,null,null,null,null,null,null,null,null,null,null,null,null,null,null,null,null,null,null,null,null,null,null,null,null,null,null,null,null,null,null,null,null,null,null,null,null,null,null,null,null,null,null,null,null,null,null,null,null,null,null,null,null,null,null,null,null,null,null,"SUAREZ"]
[null,null,null,null,null,null,null,null,null,null,null,null,null,null,null,null,null,null,null,null,null,null,null,null,null,null,null,null,null,null,null,null,null,null,null,null,null,null,null,null,null,null,null,null,null,null,null,null,null,null,null,null,null,null,null,null,null,null,null,null,null,null,null,null,null,null,null,null,null,null,"SUCRE"]
[null,null,null,null,null,null,null,null,null,null,null,null,null,null,null,null,null,null,null,null,null,null,null,null,null,null,null,null,null,null,null,null,null,null,null,null,null,null,null,null,null,null,null,null,null,null,null,null,null,null,null,null,null,null,null,null,null,null,null,null,null,null,null,null,null,null,null,null,null,null,"TIMBIO"]
[null,null,null,null,null,null,null,null,null,null,null,null,null,null,null,null,null,null,null,null,null,null,null,null,null,null,null,null,null,null,null,null,null,null,null,null,null,null,null,null,null,null,null,null,null,null,null,null,null,null,null,null,null,null,null,null,null,null,null,null,null,null,null,null,null,null,null,null,null,null,"TIMBIQUI"]
[null,null,null,null,null,null,null,null,null,null,null,null,null,null,null,null,null,null,null,null,null,null,null,null,null,null,null,null,null,null,null,null,null,null,null,null,null,null,null,null,null,null,null,null,null,null,null,null,null,null,null,null,null,null,null,null,null,null,null,null,null,null,null,null,null,null,null,null,null,null,"TORIBIO"]
[null,null,null,null,null,null,null,null,null,null,null,null,null,null,null,null,null,null,null,null,null,null,null,null,null,null,null,null,null,null,null,null,null,null,null,null,null,null,null,null,null,null,null,null,null,null,null,null,null,null,null,null,null,null,null,null,null,null,null,null,null,null,null,null,null,null,null,null,null,null,"TOTORO"]
[null,null,null,null,null,null,null,null,null,null,null,null,null,null,null,null,null,null,null,null,null,null,null,null,null,null,null,null,null,null,null,null,null,null,null,null,null,null,null,null,null,null,null,null,null,null,null,null,null,null,null,null,null,null,null,null,null,null,null,null,null,null,null,null,null,null,null,null,null,null,"VILLA RICA"]
[null,null,null,null,null,null,null,null,null,null,null,null,null,null,null,null,null,null,null,null,null,null,null,null,null,null,null,null,null,null,null,null,null,null,null,null,null,null,null,null,null,null,null,null,null,null,null,null,null,null,null,null,null,null,null,null,null,null,null,null,null,null,null,null,null,null,null,null,null,null,"AGUACHICA"]
[null,null,null,null,null,null,null,null,null,null,null,null,null,null,null,null,null,null,null,null,null,null,null,null,null,null,null,null,null,null,null,null,null,null,null,null,null,null,null,null,null,null,null,null,null,null,null,null,null,null,null,null,null,null,null,null,null,null,null,null,null,null,null,null,null,null,null,null,null,null,"AGUSTIN CODAZZI"]
[null,null,null,null,null,null,null,null,null,null,null,null,null,null,null,null,null,null,null,null,null,null,null,null,null,null,null,null,null,null,null,null,null,null,null,null,null,null,null,null,null,null,null,null,null,null,null,null,null,null,null,null,null,null,null,null,null,null,null,null,null,null,null,null,null,null,null,null,null,null,"ASTREA"]
[null,null,null,null,null,null,null,null,null,null,null,null,null,null,null,null,null,null,null,null,null,null,null,null,null,null,null,null,null,null,null,null,null,null,null,null,null,null,null,null,null,null,null,null,null,null,null,null,null,null,null,null,null,null,null,null,null,null,null,null,null,null,null,null,null,null,null,null,null,null,"BECERRIL"]
[null,null,null,null,null,null,null,null,null,null,null,null,null,null,null,null,null,null,null,null,null,null,null,null,null,null,null,null,null,null,null,null,null,null,null,null,null,null,null,null,null,null,null,null,null,null,null,null,null,null,null,null,null,null,null,null,null,null,null,null,null,null,null,null,null,null,null,null,null,null,"BOSCONIA"]
[null,null,null,null,null,null,null,null,null,null,null,null,null,null,null,null,null,null,null,null,null,null,null,null,null,null,null,null,null,null,null,null,null,null,null,null,null,null,null,null,null,null,null,null,null,null,null,null,null,null,null,null,null,null,null,null,null,null,null,null,null,null,null,null,null,null,null,null,null,null,"CHIMICHAGUA"]
[null,null,null,null,null,null,null,null,null,null,null,null,null,null,null,null,null,null,null,null,null,null,null,null,null,null,null,null,null,null,null,null,null,null,null,null,null,null,null,null,null,null,null,null,null,null,null,null,null,null,null,null,null,null,null,null,null,null,null,null,null,null,null,null,null,null,null,null,null,null,"CHIRIGUANA"]
[null,null,null,null,null,null,null,null,null,null,null,null,null,null,null,null,null,null,null,null,null,null,null,null,null,null,null,null,null,null,null,null,null,null,null,null,null,null,null,null,null,null,null,null,null,null,null,null,null,null,null,null,null,null,null,null,null,null,null,null,null,null,null,null,null,null,null,null,null,null,"CURUMANI"]
[null,null,null,null,null,null,null,null,null,null,null,null,null,null,null,null,null,null,null,null,null,null,null,null,null,null,null,null,null,null,null,null,null,null,null,null,null,null,null,null,null,null,null,null,null,null,null,null,null,null,null,null,null,null,null,null,null,null,null,null,null,null,null,null,null,null,null,null,null,null,"EL COPEY"]
[null,null,null,null,null,null,null,null,null,null,null,null,null,null,null,null,null,null,null,null,null,null,null,null,null,null,null,null,null,null,null,null,null,null,null,null,null,null,null,null,null,null,null,null,null,null,null,null,null,null,null,null,null,null,null,null,null,null,null,null,null,null,null,null,null,null,null,null,null,null,"EL PASO"]
[null,null,null,null,null,null,null,null,null,null,null,null,null,null,null,null,null,null,null,null,null,null,null,null,null,null,null,null,null,null,null,null,null,null,null,null,null,null,null,null,null,null,null,null,null,null,null,null,null,null,null,null,null,null,null,null,null,null,null,null,null,null,null,null,null,null,null,null,null,null,"GAMARRA"]
[null,null,null,null,null,null,null,null,null,null,null,null,null,null,null,null,null,null,null,null,null,null,null,null,null,null,null,null,null,null,null,null,null,null,null,null,null,null,null,null,null,null,null,null,null,null,null,null,null,null,null,null,null,null,null,null,null,null,null,null,null,null,null,null,null,null,null,null,null,null,"GONZALEZ"]
[null,null,null,null,null,null,null,null,null,null,null,null,null,null,null,null,null,null,null,null,null,null,null,null,null,null,null,null,null,null,null,null,null,null,null,null,null,null,null,null,null,null,null,null,null,null,null,null,null,null,null,null,null,null,null,null,null,null,null,null,null,null,null,null,null,null,null,null,null,null,"LA GLORIA"]
[null,null,null,null,null,null,null,null,null,null,null,null,null,null,null,null,null,null,null,null,null,null,null,null,null,null,null,null,null,null,null,null,null,null,null,null,null,null,null,null,null,null,null,null,null,null,null,null,null,null,null,null,null,null,null,null,null,null,null,null,null,null,null,null,null,null,null,null,null,null,"LA JAGUA DE IBIRICO"]
[null,null,null,null,null,null,null,null,null,null,null,null,null,null,null,null,null,null,null,null,null,null,null,null,null,null,null,null,null,null,null,null,null,null,null,null,null,null,null,null,null,null,null,null,null,null,null,null,null,null,null,null,null,null,null,null,null,null,null,null,null,null,null,null,null,null,null,null,null,null,"LA PAZ"]
[null,null,null,null,null,null,null,null,null,null,null,null,null,null,null,null,null,null,null,null,null,null,null,null,null,null,null,null,null,null,null,null,null,null,null,null,null,null,null,null,null,null,null,null,null,null,null,null,null,null,null,null,null,null,null,null,null,null,null,null,null,null,null,null,null,null,null,null,null,null,"MANAURE"]
[null,null,null,null,null,null,null,null,null,null,null,null,null,null,null,null,null,null,null,null,null,null,null,null,null,null,null,null,null,null,null,null,null,null,null,null,null,null,null,null,null,null,null,null,null,null,null,null,null,null,null,null,null,null,null,null,null,null,null,null,null,null,null,null,null,null,null,null,null,null,"PAILITAS"]
[null,null,null,null,null,null,null,null,null,null,null,null,null,null,null,null,null,null,null,null,null,null,null,null,null,null,null,null,null,null,null,null,null,null,null,null,null,null,null,null,null,null,null,null,null,null,null,null,null,null,null,null,null,null,null,null,null,null,null,null,null,null,null,null,null,null,null,null,null,null,"PELAYA"]
[null,null,null,null,null,null,null,null,null,null,null,null,null,null,null,null,null,null,null,null,null,null,null,null,null,null,null,null,null,null,null,null,null,null,null,null,null,null,null,null,null,null,null,null,null,null,null,null,null,null,null,null,null,null,null,null,null,null,null,null,null,null,null,null,null,null,null,null,null,null,"PUEBLO BELLO"]
[null,null,null,null,null,null,null,null,null,null,null,null,null,null,null,null,null,null,null,null,null,null,null,null,null,null,null,null,null,null,null,null,null,null,null,null,null,null,null,null,null,null,null,null,null,null,null,null,null,null,null,null,null,null,null,null,null,null,null,null,null,null,null,null,null,null,null,null,null,null,"RIO DE ORO"]
[null,null,null,null,null,null,null,null,null,null,null,null,null,null,null,null,null,null,null,null,null,null,null,null,null,null,null,null,null,null,null,null,null,null,null,null,null,null,null,null,null,null,null,null,null,null,null,null,null,null,null,null,null,null,null,null,null,null,null,null,null,null,null,null,null,null,null,null,null,null,"SAN ALBERTO"]
[null,null,null,null,null,null,null,null,null,null,null,null,null,null,null,null,null,null,null,null,null,null,null,null,null,null,null,null,null,null,null,null,null,null,null,null,null,null,null,null,null,null,null,null,null,null,null,null,null,null,null,null,null,null,null,null,null,null,null,null,null,null,null,null,null,null,null,null,null,null,"SAN DIEGO"]
[null,null,null,null,null,null,null,null,null,null,null,null,null,null,null,null,null,null,null,null,null,null,null,null,null,null,null,null,null,null,null,null,null,null,null,null,null,null,null,null,null,null,null,null,null,null,null,null,null,null,null,null,null,null,null,null,null,null,null,null,null,null,null,null,null,null,null,null,null,null,"SAN MARTIN"]
[null,null,null,null,null,null,null,null,null,null,null,null,null,null,null,null,null,null,null,null,null,null,null,null,null,null,null,null,null,null,null,null,null,null,null,null,null,null,null,null,null,null,null,null,null,null,null,null,null,null,null,null,null,null,null,null,null,null,null,null,null,null,null,null,null,null,null,null,null,null,"TAMALAMEQUE"]
[null,null,null,null,null,null,null,null,null,null,null,null,null,null,null,null,null,null,null,null,null,null,null,null,null,null,null,null,null,null,null,null,null,null,null,null,null,null,null,null,null,null,null,null,null,null,null,null,null,null,null,null,null,null,null,null,null,null,null,null,null,null,null,null,null,null,null,null,null,null,"VALLEDUPAR"]
[null,null,null,null,null,null,null,null,null,null,null,null,null,null,null,null,null,null,null,null,null,null,null,null,null,null,null,null,null,null,null,null,null,null,null,null,null,null,null,null,null,null,null,null,null,null,null,null,null,null,null,null,null,null,null,null,null,null,null,null,null,null,null,null,null,null,null,null,null,null,"ACANDI"]
[null,null,null,null,null,null,null,null,null,null,null,null,null,null,null,null,null,null,null,null,null,null,null,null,null,null,null,null,null,null,null,null,null,null,null,null,null,null,null,null,null,null,null,null,null,null,null,null,null,null,null,null,null,null,null,null,null,null,null,null,null,null,null,null,null,null,null,null,null,null,"ALTO BAUDO"]
[null,null,null,null,null,null,null,null,null,null,null,null,null,null,null,null,null,null,null,null,null,null,null,null,null,null,null,null,null,null,null,null,null,null,null,null,null,null,null,null,null,null,null,null,null,null,null,null,null,null,null,null,null,null,null,null,null,null,null,null,null,null,null,null,null,null,null,null,null,null,"ATRATO"]
[null,null,null,null,null,null,null,null,null,null,null,null,null,null,null,null,null,null,null,null,null,null,null,null,null,null,null,null,null,null,null,null,null,null,null,null,null,null,null,null,null,null,null,null,null,null,null,null,null,null,null,null,null,null,null,null,null,null,null,null,null,null,null,null,null,null,null,null,null,null,"BAGADO"]
[null,null,null,null,null,null,null,null,null,null,null,null,null,null,null,null,null,null,null,null,null,null,null,null,null,null,null,null,null,null,null,null,null,null,null,null,null,null,null,null,null,null,null,null,null,null,null,null,null,null,null,null,null,null,null,null,null,null,null,null,null,null,null,null,null,null,null,null,null,null,"BAHIA SOLANO"]
[null,null,null,null,null,null,null,null,null,null,null,null,null,null,null,null,null,null,null,null,null,null,null,null,null,null,null,null,null,null,null,null,null,null,null,null,null,null,null,null,null,null,null,null,null,null,null,null,null,null,null,null,null,null,null,null,null,null,null,null,null,null,null,null,null,null,null,null,null,null,"BAJO BAUDO"]
[null,null,null,null,null,null,null,null,null,null,null,null,null,null,null,null,null,null,null,null,null,null,null,null,null,null,null,null,null,null,null,null,null,null,null,null,null,null,null,null,null,null,null,null,null,null,null,null,null,null,null,null,null,null,null,null,null,null,null,null,null,null,null,null,null,null,null,null,null,null,"BOJAYA"]
[null,null,null,null,null,null,null,null,null,null,null,null,null,null,null,null,null,null,null,null,null,null,null,null,null,null,null,null,null,null,null,null,null,null,null,null,null,null,null,null,null,null,null,null,null,null,null,null,null,null,null,null,null,null,null,null,null,null,null,null,null,null,null,null,null,null,null,null,null,null,"CARMEN DEL DARIEN"]
[null,null,null,null,null,null,null,null,null,null,null,null,null,null,null,null,null,null,null,null,null,null,null,null,null,null,null,null,null,null,null,null,null,null,null,null,null,null,null,null,null,null,null,null,null,null,null,null,null,null,null,null,null,null,null,null,null,null,null,null,null,null,null,null,null,null,null,null,null,null,"CERTEGUI"]
[null,null,null,null,null,null,null,null,null,null,null,null,null,null,null,null,null,null,null,null,null,null,null,null,null,null,null,null,null,null,null,null,null,null,null,null,null,null,null,null,null,null,null,null,null,null,null,null,null,null,null,null,null,null,null,null,null,null,null,null,null,null,null,null,null,null,null,null,null,null,"CONDOTO"]
[null,null,null,null,null,null,null,null,null,null,null,null,null,null,null,null,null,null,null,null,null,null,null,null,null,null,null,null,null,null,null,null,null,null,null,null,null,null,null,null,null,null,null,null,null,null,null,null,null,null,null,null,null,null,null,null,null,null,null,null,null,null,null,null,null,null,null,null,null,null,"EL CANTON DEL SAN PABLO"]
[null,null,null,null,null,null,null,null,null,null,null,null,null,null,null,null,null,null,null,null,null,null,null,null,null,null,null,null,null,null,null,null,null,null,null,null,null,null,null,null,null,null,null,null,null,null,null,null,null,null,null,null,null,null,null,null,null,null,null,null,null,null,null,null,null,null,null,null,null,null,"EL CARMEN DE ATRATO"]
[null,null,null,null,null,null,null,null,null,null,null,null,null,null,null,null,null,null,null,null,null,null,null,null,null,null,null,null,null,null,null,null,null,null,null,null,null,null,null,null,null,null,null,null,null,null,null,null,null,null,null,null,null,null,null,null,null,null,null,null,null,null,null,null,null,null,null,null,null,null,"EL LITORAL DEL SAN JUAN"]
[null,null,null,null,null,null,null,null,null,null,null,null,null,null,null,null,null,null,null,null,null,null,null,null,null,null,null,null,null,null,null,null,null,null,null,null,null,null,null,null,null,null,null,null,null,null,null,null,null,null,null,null,null,null,null,null,null,null,null,null,null,null,null,null,null,null,null,null,null,null,"ISTMINA"]
[null,null,null,null,null,null,null,null,null,null,null,null,null,null,null,null,null,null,null,null,null,null,null,null,null,null,null,null,null,null,null,null,null,null,null,null,null,null,null,null,null,null,null,null,null,null,null,null,null,null,null,null,null,null,null,null,null,null,null,null,null,null,null,null,null,null,null,null,null,null,"JURADO"]
[null,null,null,null,null,null,null,null,null,null,null,null,null,null,null,null,null,null,null,null,null,null,null,null,null,null,null,null,null,null,null,null,null,null,null,null,null,null,null,null,null,null,null,null,null,null,null,null,null,null,null,null,null,null,null,null,null,null,null,null,null,null,null,null,null,null,null,null,null,null,"LLORO"]
[null,null,null,null,null,null,null,null,null,null,null,null,null,null,null,null,null,null,null,null,null,null,null,null,null,null,null,null,null,null,null,null,null,null,null,null,null,null,null,null,null,null,null,null,null,null,null,null,null,null,null,null,null,null,null,null,null,null,null,null,null,null,null,null,null,null,null,null,null,null,"MEDIO ATRATO"]
[null,null,null,null,null,null,null,null,null,null,null,null,null,null,null,null,null,null,null,null,null,null,null,null,null,null,null,null,null,null,null,null,null,null,null,null,null,null,null,null,null,null,null,null,null,null,null,null,null,null,null,null,null,null,null,null,null,null,null,null,null,null,null,null,null,null,null,null,null,null,"MEDIO BAUDO"]
[null,null,null,null,null,null,null,null,null,null,null,null,null,null,null,null,null,null,null,null,null,null,null,null,null,null,null,null,null,null,null,null,null,null,null,null,null,null,null,null,null,null,null,null,null,null,null,null,null,null,null,null,null,null,null,null,null,null,null,null,null,null,null,null,null,null,null,null,null,null,"MEDIO SAN JUAN"]
[null,null,null,null,null,null,null,null,null,null,null,null,null,null,null,null,null,null,null,null,null,null,null,null,null,null,null,null,null,null,null,null,null,null,null,null,null,null,null,null,null,null,null,null,null,null,null,null,null,null,null,null,null,null,null,null,null,null,null,null,null,null,null,null,null,null,null,null,null,null,"NOVITA"]
[null,null,null,null,null,null,null,null,null,null,null,null,null,null,null,null,null,null,null,null,null,null,null,null,null,null,null,null,null,null,null,null,null,null,null,null,null,null,null,null,null,null,null,null,null,null,null,null,null,null,null,null,null,null,null,null,null,null,null,null,null,null,null,null,null,null,null,null,null,null,"NUQUI"]
[null,null,null,null,null,null,null,null,null,null,null,null,null,null,null,null,null,null,null,null,null,null,null,null,null,null,null,null,null,null,null,null,null,null,null,null,null,null,null,null,null,null,null,null,null,null,null,null,null,null,null,null,null,null,null,null,null,null,null,null,null,null,null,null,null,null,null,null,null,null,"QUIBDO"]
[null,null,null,null,null,null,null,null,null,null,null,null,null,null,null,null,null,null,null,null,null,null,null,null,null,null,null,null,null,null,null,null,null,null,null,null,null,null,null,null,null,null,null,null,null,null,null,null,null,null,null,null,null,null,null,null,null,null,null,null,null,null,null,null,null,null,null,null,null,null,"RIO IRO"]
[null,null,null,null,null,null,null,null,null,null,null,null,null,null,null,null,null,null,null,null,null,null,null,null,null,null,null,null,null,null,null,null,null,null,null,null,null,null,null,null,null,null,null,null,null,null,null,null,null,null,null,null,null,null,null,null,null,null,null,null,null,null,null,null,null,null,null,null,null,null,"RIO QUITO"]
[null,null,null,null,null,null,null,null,null,null,null,null,null,null,null,null,null,null,null,null,null,null,null,null,null,null,null,null,null,null,null,null,null,null,null,null,null,null,null,null,null,null,null,null,null,null,null,null,null,null,null,null,null,null,null,null,null,null,null,null,null,null,null,null,null,null,null,null,null,null,"RIOSUCIO"]
[null,null,null,null,null,null,null,null,null,null,null,null,null,null,null,null,null,null,null,null,null,null,null,null,null,null,null,null,null,null,null,null,null,null,null,null,null,null,null,null,null,null,null,null,null,null,null,null,null,null,null,null,null,null,null,null,null,null,null,null,null,null,null,null,null,null,null,null,null,null,"SAN JOSE DEL PALMAR"]
[null,null,null,null,null,null,null,null,null,null,null,null,null,null,null,null,null,null,null,null,null,null,null,null,null,null,null,null,null,null,null,null,null,null,null,null,null,null,null,null,null,null,null,null,null,null,null,null,null,null,null,null,null,null,null,null,null,null,null,null,null,null,null,null,null,null,null,null,null,null,"SIPI"]
[null,null,null,null,null,null,null,null,null,null,null,null,null,null,null,null,null,null,null,null,null,null,null,null,null,null,null,null,null,null,null,null,null,null,null,null,null,null,null,null,null,null,null,null,null,null,null,null,null,null,null,null,null,null,null,null,null,null,null,null,null,null,null,null,null,null,null,null,null,null,"TADO"]
[null,null,null,null,null,null,null,null,null,null,null,null,null,null,null,null,null,null,null,null,null,null,null,null,null,null,null,null,null,null,null,null,null,null,null,null,null,null,null,null,null,null,null,null,null,null,null,null,null,null,null,null,null,null,null,null,null,null,null,null,null,null,null,null,null,null,null,null,null,null,"UNGUIA"]
[null,null,null,null,null,null,null,null,null,null,null,null,null,null,null,null,null,null,null,null,null,null,null,null,null,null,null,null,null,null,null,null,null,null,null,null,null,null,null,null,null,null,null,null,null,null,null,null,null,null,null,null,null,null,null,null,null,null,null,null,null,null,null,null,null,null,null,null,null,null,"UNION PANAMERICANA"]
[null,null,null,null,null,null,null,null,null,null,null,null,null,null,null,null,null,null,null,null,null,null,null,null,null,null,null,null,null,null,null,null,null,null,null,null,null,null,null,null,null,null,null,null,null,null,null,null,null,null,null,null,null,null,null,null,null,null,null,null,null,null,null,null,null,null,null,null,null,null,"AYAPEL"]
[null,null,null,null,null,null,null,null,null,null,null,null,null,null,null,null,null,null,null,null,null,null,null,null,null,null,null,null,null,null,null,null,null,null,null,null,null,null,null,null,null,null,null,null,null,null,null,null,null,null,null,null,null,null,null,null,null,null,null,null,null,null,null,null,null,null,null,null,null,null,"BUENAVISTA"]
[null,null,null,null,null,null,null,null,null,null,null,null,null,null,null,null,null,null,null,null,null,null,null,null,null,null,null,null,null,null,null,null,null,null,null,null,null,null,null,null,null,null,null,null,null,null,null,null,null,null,null,null,null,null,null,null,null,null,null,null,null,null,null,null,null,null,null,null,null,null,"CANALETE"]
[null,null,null,null,null,null,null,null,null,null,null,null,null,null,null,null,null,null,null,null,null,null,null,null,null,null,null,null,null,null,null,null,null,null,null,null,null,null,null,null,null,null,null,null,null,null,null,null,null,null,null,null,null,null,null,null,null,null,null,null,null,null,null,null,null,null,null,null,null,null,"CERETE"]
[null,null,null,null,null,null,null,null,null,null,null,null,null,null,null,null,null,null,null,null,null,null,null,null,null,null,null,null,null,null,null,null,null,null,null,null,null,null,null,null,null,null,null,null,null,null,null,null,null,null,null,null,null,null,null,null,null,null,null,null,null,null,null,null,null,null,null,null,null,null,"CHIMA"]
[null,null,null,null,null,null,null,null,null,null,null,null,null,null,null,null,null,null,null,null,null,null,null,null,null,null,null,null,null,null,null,null,null,null,null,null,null,null,null,null,null,null,null,null,null,null,null,null,null,null,null,null,null,null,null,null,null,null,null,null,null,null,null,null,null,null,null,null,null,null,"CHINU"]
[null,null,null,null,null,null,null,null,null,null,null,null,null,null,null,null,null,null,null,null,null,null,null,null,null,null,null,null,null,null,null,null,null,null,null,null,null,null,null,null,null,null,null,null,null,null,null,null,null,null,null,null,null,null,null,null,null,null,null,null,null,null,null,null,null,null,null,null,null,null,"CIENAGA DE ORO"]
[null,null,null,null,null,null,null,null,null,null,null,null,null,null,null,null,null,null,null,null,null,null,null,null,null,null,null,null,null,null,null,null,null,null,null,null,null,null,null,null,null,null,null,null,null,null,null,null,null,null,null,null,null,null,null,null,null,null,null,null,null,null,null,null,null,null,null,null,null,null,"COTORRA"]
[null,null,null,null,null,null,null,null,null,null,null,null,null,null,null,null,null,null,null,null,null,null,null,null,null,null,null,null,null,null,null,null,null,null,null,null,null,null,null,null,null,null,null,null,null,null,null,null,null,null,null,null,null,null,null,null,null,null,null,null,null,null,null,null,null,null,null,null,null,null,"LA APARTADA"]
[null,null,null,null,null,null,null,null,null,null,null,null,null,null,null,null,null,null,null,null,null,null,null,null,null,null,null,null,null,null,null,null,null,null,null,null,null,null,null,null,null,null,null,null,null,null,null,null,null,null,null,null,null,null,null,null,null,null,null,null,null,null,null,null,null,null,null,null,null,null,"LORICA"]
[null,null,null,null,null,null,null,null,null,null,null,null,null,null,null,null,null,null,null,null,null,null,null,null,null,null,null,null,null,null,null,null,null,null,null,null,null,null,null,null,null,null,null,null,null,null,null,null,null,null,null,null,null,null,null,null,null,null,null,null,null,null,null,null,null,null,null,null,null,null,"LOS CORDOBAS"]
[null,null,null,null,null,null,null,null,null,null,null,null,null,null,null,null,null,null,null,null,null,null,null,null,null,null,null,null,null,null,null,null,null,null,null,null,null,null,null,null,null,null,null,null,null,null,null,null,null,null,null,null,null,null,null,null,null,null,null,null,null,null,null,null,null,null,null,null,null,null,"MOMIL"]
[null,null,null,null,null,null,null,null,null,null,null,null,null,null,null,null,null,null,null,null,null,null,null,null,null,null,null,null,null,null,null,null,null,null,null,null,null,null,null,null,null,null,null,null,null,null,null,null,null,null,null,null,null,null,null,null,null,null,null,null,null,null,null,null,null,null,null,null,null,null,"MONTELIBANO"]
[null,null,null,null,null,null,null,null,null,null,null,null,null,null,null,null,null,null,null,null,null,null,null,null,null,null,null,null,null,null,null,null,null,null,null,null,null,null,null,null,null,null,null,null,null,null,null,null,null,null,null,null,null,null,null,null,null,null,null,null,null,null,null,null,null,null,null,null,null,null,"MONTERIA"]
[null,null,null,null,null,null,null,null,null,null,null,null,null,null,null,null,null,null,null,null,null,null,null,null,null,null,null,null,null,null,null,null,null,null,null,null,null,null,null,null,null,null,null,null,null,null,null,null,null,null,null,null,null,null,null,null,null,null,null,null,null,null,null,null,null,null,null,null,null,null,"MOÑITOS"]
[null,null,null,null,null,null,null,null,null,null,null,null,null,null,null,null,null,null,null,null,null,null,null,null,null,null,null,null,null,null,null,null,null,null,null,null,null,null,null,null,null,null,null,null,null,null,null,null,null,null,null,null,null,null,null,null,null,null,null,null,null,null,null,null,null,null,null,null,null,null,"PLANETA RICA"]
[null,null,null,null,null,null,null,null,null,null,null,null,null,null,null,null,null,null,null,null,null,null,null,null,null,null,null,null,null,null,null,null,null,null,null,null,null,null,null,null,null,null,null,null,null,null,null,null,null,null,null,null,null,null,null,null,null,null,null,null,null,null,null,null,null,null,null,null,null,null,"PUEBLO NUEVO"]
[null,null,null,null,null,null,null,null,null,null,null,null,null,null,null,null,null,null,null,null,null,null,null,null,null,null,null,null,null,null,null,null,null,null,null,null,null,null,null,null,null,null,null,null,null,null,null,null,null,null,null,null,null,null,null,null,null,null,null,null,null,null,null,null,null,null,null,null,null,null,"PUERTO ESCONDIDO"]
[null,null,null,null,null,null,null,null,null,null,null,null,null,null,null,null,null,null,null,null,null,null,null,null,null,null,null,null,null,null,null,null,null,null,null,null,null,null,null,null,null,null,null,null,null,null,null,null,null,null,null,null,null,null,null,null,null,null,null,null,null,null,null,null,null,null,null,null,null,null,"PUERTO LIBERTADOR"]
[null,null,null,null,null,null,null,null,null,null,null,null,null,null,null,null,null,null,null,null,null,null,null,null,null,null,null,null,null,null,null,null,null,null,null,null,null,null,null,null,null,null,null,null,null,null,null,null,null,null,null,null,null,null,null,null,null,null,null,null,null,null,null,null,null,null,null,null,null,null,"PURISIMA"]
[null,null,null,null,null,null,null,null,null,null,null,null,null,null,null,null,null,null,null,null,null,null,null,null,null,null,null,null,null,null,null,null,null,null,null,null,null,null,null,null,null,null,null,null,null,null,null,null,null,null,null,null,null,null,null,null,null,null,null,null,null,null,null,null,null,null,null,null,null,null,"SAHAGUN"]
[null,null,null,null,null,null,null,null,null,null,null,null,null,null,null,null,null,null,null,null,null,null,null,null,null,null,null,null,null,null,null,null,null,null,null,null,null,null,null,null,null,null,null,null,null,null,null,null,null,null,null,null,null,null,null,null,null,null,null,null,null,null,null,null,null,null,null,null,null,null,"SAN ANDRES SOTAVENTO"]
[null,null,null,null,null,null,null,null,null,null,null,null,null,null,null,null,null,null,null,null,null,null,null,null,null,null,null,null,null,null,null,null,null,null,null,null,null,null,null,null,null,null,null,null,null,null,null,null,null,null,null,null,null,null,null,null,null,null,null,null,null,null,null,null,null,null,null,null,null,null,"SAN ANTERO"]
[null,null,null,null,null,null,null,null,null,null,null,null,null,null,null,null,null,null,null,null,null,null,null,null,null,null,null,null,null,null,null,null,null,null,null,null,null,null,null,null,null,null,null,null,null,null,null,null,null,null,null,null,null,null,null,null,null,null,null,null,null,null,null,null,null,null,null,null,null,null,"SAN BERNARDO DEL VIENTO"]
[null,null,null,null,null,null,null,null,null,null,null,null,null,null,null,null,null,null,null,null,null,null,null,null,null,null,null,null,null,null,null,null,null,null,null,null,null,null,null,null,null,null,null,null,null,null,null,null,null,null,null,null,null,null,null,null,null,null,null,null,null,null,null,null,null,null,null,null,null,null,"SAN CARLOS"]
[null,null,null,null,null,null,null,null,null,null,null,null,null,null,null,null,null,null,null,null,null,null,null,null,null,null,null,null,null,null,null,null,null,null,null,null,null,null,null,null,null,null,null,null,null,null,null,null,null,null,null,null,null,null,null,null,null,null,null,null,null,null,null,null,null,null,null,null,null,null,"SAN PELAYO"]
[null,null,null,null,null,null,null,null,null,null,null,null,null,null,null,null,null,null,null,null,null,null,null,null,null,null,null,null,null,null,null,null,null,null,null,null,null,null,null,null,null,null,null,null,null,null,null,null,null,null,null,null,null,null,null,null,null,null,null,null,null,null,null,null,null,null,null,null,null,null,"TIERRALTA"]
[null,null,null,null,null,null,null,null,null,null,null,null,null,null,null,null,null,null,null,null,null,null,null,null,null,null,null,null,null,null,null,null,null,null,null,null,null,null,null,null,null,null,null,null,null,null,null,null,null,null,null,null,null,null,null,null,null,null,null,null,null,null,null,null,null,null,null,null,null,null,"VALENCIA"]
[null,null,null,null,null,null,null,null,null,null,null,null,null,null,null,null,null,null,null,null,null,null,null,null,null,null,null,null,null,null,null,null,null,null,null,null,null,null,null,null,null,null,null,null,null,null,null,null,null,null,null,null,null,null,null,null,null,null,null,null,null,null,null,null,null,null,null,null,null,null,"AGUA DE DIOS"]
[null,null,null,null,null,null,null,null,null,null,null,null,null,null,null,null,null,null,null,null,null,null,null,null,null,null,null,null,null,null,null,null,null,null,null,null,null,null,null,null,null,null,null,null,null,null,null,null,null,null,null,null,null,null,null,null,null,null,null,null,null,null,null,null,null,null,null,null,null,null,"ALBAN"]
[null,null,null,null,null,null,null,null,null,null,null,null,null,null,null,null,null,null,null,null,null,null,null,null,null,null,null,null,null,null,null,null,null,null,null,null,null,null,null,null,null,null,null,null,null,null,null,null,null,null,null,null,null,null,null,null,null,null,null,null,null,null,null,null,null,null,null,null,null,null,"ANAPOIMA"]
[null,null,null,null,null,null,null,null,null,null,null,null,null,null,null,null,null,null,null,null,null,null,null,null,null,null,null,null,null,null,null,null,null,null,null,null,null,null,null,null,null,null,null,null,null,null,null,null,null,null,null,null,null,null,null,null,null,null,null,null,null,null,null,null,null,null,null,null,null,null,"ANOLAIMA"]
[null,null,null,null,null,null,null,null,null,null,null,null,null,null,null,null,null,null,null,null,null,null,null,null,null,null,null,null,null,null,null,null,null,null,null,null,null,null,null,null,null,null,null,null,null,null,null,null,null,null,null,null,null,null,null,null,null,null,null,null,null,null,null,null,null,null,null,null,null,null,"APULO"]
[null,null,null,null,null,null,null,null,null,null,null,null,null,null,null,null,null,null,null,null,null,null,null,null,null,null,null,null,null,null,null,null,null,null,null,null,null,null,null,null,null,null,null,null,null,null,null,null,null,null,null,null,null,null,null,null,null,null,null,null,null,null,null,null,null,null,null,null,null,null,"ARBELAEZ"]
[null,null,null,null,null,null,null,null,null,null,null,null,null,null,null,null,null,null,null,null,null,null,null,null,null,null,null,null,null,null,null,null,null,null,null,null,null,null,null,null,null,null,null,null,null,null,null,null,null,null,null,null,null,null,null,null,null,null,null,null,null,null,null,null,null,null,null,null,null,null,"BELTRAN"]
[null,null,null,null,null,null,null,null,null,null,null,null,null,null,null,null,null,null,null,null,null,null,null,null,null,null,null,null,null,null,null,null,null,null,null,null,null,null,null,null,null,null,null,null,null,null,null,null,null,null,null,null,null,null,null,null,null,null,null,null,null,null,null,null,null,null,null,null,null,null,"BITUIMA"]
[null,null,null,null,null,null,null,null,null,null,null,null,null,null,null,null,null,null,null,null,null,null,null,null,null,null,null,null,null,null,null,null,null,null,null,null,null,null,null,null,null,null,null,null,null,null,null,null,null,null,null,null,null,null,null,null,null,null,null,null,null,null,null,null,null,null,null,null,null,null,"BOJACA"]
[null,null,null,null,null,null,null,null,null,null,null,null,null,null,null,null,null,null,null,null,null,null,null,null,null,null,null,null,null,null,null,null,null,null,null,null,null,null,null,null,null,null,null,null,null,null,null,null,null,null,null,null,null,null,null,null,null,null,null,null,null,null,null,null,null,null,null,null,null,null,"CABRERA"]
[null,null,null,null,null,null,null,null,null,null,null,null,null,null,null,null,null,null,null,null,null,null,null,null,null,null,null,null,null,null,null,null,null,null,null,null,null,null,null,null,null,null,null,null,null,null,null,null,null,null,null,null,null,null,null,null,null,null,null,null,null,null,null,null,null,null,null,null,null,null,"CACHIPAY"]
[null,null,null,null,null,null,null,null,null,null,null,null,null,null,null,null,null,null,null,null,null,null,null,null,null,null,null,null,null,null,null,null,null,null,null,null,null,null,null,null,null,null,null,null,null,null,null,null,null,null,null,null,null,null,null,null,null,null,null,null,null,null,null,null,null,null,null,null,null,null,"CAJICA"]
[null,null,null,null,null,null,null,null,null,null,null,null,null,null,null,null,null,null,null,null,null,null,null,null,null,null,null,null,null,null,null,null,null,null,null,null,null,null,null,null,null,null,null,null,null,null,null,null,null,null,null,null,null,null,null,null,null,null,null,null,null,null,null,null,null,null,null,null,null,null,"CAPARRAPI"]
[null,null,null,null,null,null,null,null,null,null,null,null,null,null,null,null,null,null,null,null,null,null,null,null,null,null,null,null,null,null,null,null,null,null,null,null,null,null,null,null,null,null,null,null,null,null,null,null,null,null,null,null,null,null,null,null,null,null,null,null,null,null,null,null,null,null,null,null,null,null,"CAQUEZA"]
[null,null,null,null,null,null,null,null,null,null,null,null,null,null,null,null,null,null,null,null,null,null,null,null,null,null,null,null,null,null,null,null,null,null,null,null,null,null,null,null,null,null,null,null,null,null,null,null,null,null,null,null,null,null,null,null,null,null,null,null,null,null,null,null,null,null,null,null,null,null,"CARMEN DE CARUPA"]
[null,null,null,null,null,null,null,null,null,null,null,null,null,null,null,null,null,null,null,null,null,null,null,null,null,null,null,null,null,null,null,null,null,null,null,null,null,null,null,null,null,null,null,null,null,null,null,null,null,null,null,null,null,null,null,null,null,null,null,null,null,null,null,null,null,null,null,null,null,null,"CHAGUANI"]
[null,null,null,null,null,null,null,null,null,null,null,null,null,null,null,null,null,null,null,null,null,null,null,null,null,null,null,null,null,null,null,null,null,null,null,null,null,null,null,null,null,null,null,null,null,null,null,null,null,null,null,null,null,null,null,null,null,null,null,null,null,null,null,null,null,null,null,null,null,null,"CHIA"]
[null,null,null,null,null,null,null,null,null,null,null,null,null,null,null,null,null,null,null,null,null,null,null,null,null,null,null,null,null,null,null,null,null,null,null,null,null,null,null,null,null,null,null,null,null,null,null,null,null,null,null,null,null,null,null,null,null,null,null,null,null,null,null,null,null,null,null,null,null,null,"CHIPAQUE"]
[null,null,null,null,null,null,null,null,null,null,null,null,null,null,null,null,null,null,null,null,null,null,null,null,null,null,null,null,null,null,null,null,null,null,null,null,null,null,null,null,null,null,null,null,null,null,null,null,null,null,null,null,null,null,null,null,null,null,null,null,null,null,null,null,null,null,null,null,null,null,"CHOACHI"]
[null,null,null,null,null,null,null,null,null,null,null,null,null,null,null,null,null,null,null,null,null,null,null,null,null,null,null,null,null,null,null,null,null,null,null,null,null,null,null,null,null,null,null,null,null,null,null,null,null,null,null,null,null,null,null,null,null,null,null,null,null,null,null,null,null,null,null,null,null,null,"CHOCONTA"]
[null,null,null,null,null,null,null,null,null,null,null,null,null,null,null,null,null,null,null,null,null,null,null,null,null,null,null,null,null,null,null,null,null,null,null,null,null,null,null,null,null,null,null,null,null,null,null,null,null,null,null,null,null,null,null,null,null,null,null,null,null,null,null,null,null,null,null,null,null,null,"COGUA"]
[null,null,null,null,null,null,null,null,null,null,null,null,null,null,null,null,null,null,null,null,null,null,null,null,null,null,null,null,null,null,null,null,null,null,null,null,null,null,null,null,null,null,null,null,null,null,null,null,null,null,null,null,null,null,null,null,null,null,null,null,null,null,null,null,null,null,null,null,null,null,"COTA"]
[null,null,null,null,null,null,null,null,null,null,null,null,null,null,null,null,null,null,null,null,null,null,null,null,null,null,null,null,null,null,null,null,null,null,null,null,null,null,null,null,null,null,null,null,null,null,null,null,null,null,null,null,null,null,null,null,null,null,null,null,null,null,null,null,null,null,null,null,null,null,"CUCUNUBA"]
[null,null,null,null,null,null,null,null,null,null,null,null,null,null,null,null,null,null,null,null,null,null,null,null,null,null,null,null,null,null,null,null,null,null,null,null,null,null,null,null,null,null,null,null,null,null,null,null,null,null,null,null,null,null,null,null,null,null,null,null,null,null,null,null,null,null,null,null,null,null,"EL COLEGIO"]
[null,null,null,null,null,null,null,null,null,null,null,null,null,null,null,null,null,null,null,null,null,null,null,null,null,null,null,null,null,null,null,null,null,null,null,null,null,null,null,null,null,null,null,null,null,null,null,null,null,null,null,null,null,null,null,null,null,null,null,null,null,null,null,null,null,null,null,null,null,null,"EL PEÑON"]
[null,null,null,null,null,null,null,null,null,null,null,null,null,null,null,null,null,null,null,null,null,null,null,null,null,null,null,null,null,null,null,null,null,null,null,null,null,null,null,null,null,null,null,null,null,null,null,null,null,null,null,null,null,null,null,null,null,null,null,null,null,null,null,null,null,null,null,null,null,null,"EL ROSAL"]
[null,null,null,null,null,null,null,null,null,null,null,null,null,null,null,null,null,null,null,null,null,null,null,null,null,null,null,null,null,null,null,null,null,null,null,null,null,null,null,null,null,null,null,null,null,null,null,null,null,null,null,null,null,null,null,null,null,null,null,null,null,null,null,null,null,null,null,null,null,null,"FACATATIVA"]
[null,null,null,null,null,null,null,null,null,null,null,null,null,null,null,null,null,null,null,null,null,null,null,null,null,null,null,null,null,null,null,null,null,null,null,null,null,null,null,null,null,null,null,null,null,null,null,null,null,null,null,null,null,null,null,null,null,null,null,null,null,null,null,null,null,null,null,null,null,null,"FOMEQUE"]
[null,null,null,null,null,null,null,null,null,null,null,null,null,null,null,null,null,null,null,null,null,null,null,null,null,null,null,null,null,null,null,null,null,null,null,null,null,null,null,null,null,null,null,null,null,null,null,null,null,null,null,null,null,null,null,null,null,null,null,null,null,null,null,null,null,null,null,null,null,null,"FOSCA"]
[null,null,null,null,null,null,null,null,null,null,null,null,null,null,null,null,null,null,null,null,null,null,null,null,null,null,null,null,null,null,null,null,null,null,null,null,null,null,null,null,null,null,null,null,null,null,null,null,null,null,null,null,null,null,null,null,null,null,null,null,null,null,null,null,null,null,null,null,null,null,"FUNZA"]
[null,null,null,null,null,null,null,null,null,null,null,null,null,null,null,null,null,null,null,null,null,null,null,null,null,null,null,null,null,null,null,null,null,null,null,null,null,null,null,null,null,null,null,null,null,null,null,null,null,null,null,null,null,null,null,null,null,null,null,null,null,null,null,null,null,null,null,null,null,null,"FUQUENE"]
[null,null,null,null,null,null,null,null,null,null,null,null,null,null,null,null,null,null,null,null,null,null,null,null,null,null,null,null,null,null,null,null,null,null,null,null,null,null,null,null,null,null,null,null,null,null,null,null,null,null,null,null,null,null,null,null,null,null,null,null,null,null,null,null,null,null,null,null,null,null,"FUSAGASUGA"]
[null,null,null,null,null,null,null,null,null,null,null,null,null,null,null,null,null,null,null,null,null,null,null,null,null,null,null,null,null,null,null,null,null,null,null,null,null,null,null,null,null,null,null,null,null,null,null,null,null,null,null,null,null,null,null,null,null,null,null,null,null,null,null,null,null,null,null,null,null,null,"GACHALA"]
[null,null,null,null,null,null,null,null,null,null,null,null,null,null,null,null,null,null,null,null,null,null,null,null,null,null,null,null,null,null,null,null,null,null,null,null,null,null,null,null,null,null,null,null,null,null,null,null,null,null,null,null,null,null,null,null,null,null,null,null,null,null,null,null,null,null,null,null,null,null,"GACHANCIPA"]
[null,null,null,null,null,null,null,null,null,null,null,null,null,null,null,null,null,null,null,null,null,null,null,null,null,null,null,null,null,null,null,null,null,null,null,null,null,null,null,null,null,null,null,null,null,null,null,null,null,null,null,null,null,null,null,null,null,null,null,null,null,null,null,null,null,null,null,null,null,null,"GACHETA"]
[null,null,null,null,null,null,null,null,null,null,null,null,null,null,null,null,null,null,null,null,null,null,null,null,null,null,null,null,null,null,null,null,null,null,null,null,null,null,null,null,null,null,null,null,null,null,null,null,null,null,null,null,null,null,null,null,null,null,null,null,null,null,null,null,null,null,null,null,null,null,"GAMA"]
[null,null,null,null,null,null,null,null,null,null,null,null,null,null,null,null,null,null,null,null,null,null,null,null,null,null,null,null,null,null,null,null,null,null,null,null,null,null,null,null,null,null,null,null,null,null,null,null,null,null,null,null,null,null,null,null,null,null,null,null,null,null,null,null,null,null,null,null,null,null,"GIRARDOT"]
[null,null,null,null,null,null,null,null,null,null,null,null,null,null,null,null,null,null,null,null,null,null,null,null,null,null,null,null,null,null,null,null,null,null,null,null,null,null,null,null,null,null,null,null,null,null,null,null,null,null,null,null,null,null,null,null,null,null,null,null,null,null,null,null,null,null,null,null,null,null,"GRANADA"]
[null,null,null,null,null,null,null,null,null,null,null,null,null,null,null,null,null,null,null,null,null,null,null,null,null,null,null,null,null,null,null,null,null,null,null,null,null,null,null,null,null,null,null,null,null,null,null,null,null,null,null,null,null,null,null,null,null,null,null,null,null,null,null,null,null,null,null,null,null,null,"GUACHETA"]
[null,null,null,null,null,null,null,null,null,null,null,null,null,null,null,null,null,null,null,null,null,null,null,null,null,null,null,null,null,null,null,null,null,null,null,null,null,null,null,null,null,null,null,null,null,null,null,null,null,null,null,null,null,null,null,null,null,null,null,null,null,null,null,null,null,null,null,null,null,null,"GUADUAS"]
[null,null,null,null,null,null,null,null,null,null,null,null,null,null,null,null,null,null,null,null,null,null,null,null,null,null,null,null,null,null,null,null,null,null,null,null,null,null,null,null,null,null,null,null,null,null,null,null,null,null,null,null,null,null,null,null,null,null,null,null,null,null,null,null,null,null,null,null,null,null,"GUASCA"]
[null,null,null,null,null,null,null,null,null,null,null,null,null,null,null,null,null,null,null,null,null,null,null,null,null,null,null,null,null,null,null,null,null,null,null,null,null,null,null,null,null,null,null,null,null,null,null,null,null,null,null,null,null,null,null,null,null,null,null,null,null,null,null,null,null,null,null,null,null,null,"GUATAQUI"]
[null,null,null,null,null,null,null,null,null,null,null,null,null,null,null,null,null,null,null,null,null,null,null,null,null,null,null,null,null,null,null,null,null,null,null,null,null,null,null,null,null,null,null,null,null,null,null,null,null,null,null,null,null,null,null,null,null,null,null,null,null,null,null,null,null,null,null,null,null,null,"GUATAVITA"]
[null,null,null,null,null,null,null,null,null,null,null,null,null,null,null,null,null,null,null,null,null,null,null,null,null,null,null,null,null,null,null,null,null,null,null,null,null,null,null,null,null,null,null,null,null,null,null,null,null,null,null,null,null,null,null,null,null,null,null,null,null,null,null,null,null,null,null,null,null,null,"GUAYABAL DE SIQUIMA"]
[null,null,null,null,null,null,null,null,null,null,null,null,null,null,null,null,null,null,null,null,null,null,null,null,null,null,null,null,null,null,null,null,null,null,null,null,null,null,null,null,null,null,null,null,null,null,null,null,null,null,null,null,null,null,null,null,null,null,null,null,null,null,null,null,null,null,null,null,null,null,"GUAYABETAL"]
[null,null,null,null,null,null,null,null,null,null,null,null,null,null,null,null,null,null,null,null,null,null,null,null,null,null,null,null,null,null,null,null,null,null,null,null,null,null,null,null,null,null,null,null,null,null,null,null,null,null,null,null,null,null,null,null,null,null,null,null,null,null,null,null,null,null,null,null,null,null,"GUTIERREZ"]
[null,null,null,null,null,null,null,null,null,null,null,null,null,null,null,null,null,null,null,null,null,null,null,null,null,null,null,null,null,null,null,null,null,null,null,null,null,null,null,null,null,null,null,null,null,null,null,null,null,null,null,null,null,null,null,null,null,null,null,null,null,null,null,null,null,null,null,null,null,null,"JERUSALEN"]
[null,null,null,null,null,null,null,null,null,null,null,null,null,null,null,null,null,null,null,null,null,null,null,null,null,null,null,null,null,null,null,null,null,null,null,null,null,null,null,null,null,null,null,null,null,null,null,null,null,null,null,null,null,null,null,null,null,null,null,null,null,null,null,null,null,null,null,null,null,null,"JUNIN"]
[null,null,null,null,null,null,null,null,null,null,null,null,null,null,null,null,null,null,null,null,null,null,null,null,null,null,null,null,null,null,null,null,null,null,null,null,null,null,null,null,null,null,null,null,null,null,null,null,null,null,null,null,null,null,null,null,null,null,null,null,null,null,null,null,null,null,null,null,null,null,"LA CALERA"]
[null,null,null,null,null,null,null,null,null,null,null,null,null,null,null,null,null,null,null,null,null,null,null,null,null,null,null,null,null,null,null,null,null,null,null,null,null,null,null,null,null,null,null,null,null,null,null,null,null,null,null,null,null,null,null,null,null,null,null,null,null,null,null,null,null,null,null,null,null,null,"LA MESA"]
[null,null,null,null,null,null,null,null,null,null,null,null,null,null,null,null,null,null,null,null,null,null,null,null,null,null,null,null,null,null,null,null,null,null,null,null,null,null,null,null,null,null,null,null,null,null,null,null,null,null,null,null,null,null,null,null,null,null,null,null,null,null,null,null,null,null,null,null,null,null,"LA PALMA"]
[null,null,null,null,null,null,null,null,null,null,null,null,null,null,null,null,null,null,null,null,null,null,null,null,null,null,null,null,null,null,null,null,null,null,null,null,null,null,null,null,null,null,null,null,null,null,null,null,null,null,null,null,null,null,null,null,null,null,null,null,null,null,null,null,null,null,null,null,null,null,"LA PEÑA"]
[null,null,null,null,null,null,null,null,null,null,null,null,null,null,null,null,null,null,null,null,null,null,null,null,null,null,null,null,null,null,null,null,null,null,null,null,null,null,null,null,null,null,null,null,null,null,null,null,null,null,null,null,null,null,null,null,null,null,null,null,null,null,null,null,null,null,null,null,null,null,"LA VEGA"]
[null,null,null,null,null,null,null,null,null,null,null,null,null,null,null,null,null,null,null,null,null,null,null,null,null,null,null,null,null,null,null,null,null,null,null,null,null,null,null,null,null,null,null,null,null,null,null,null,null,null,null,null,null,null,null,null,null,null,null,null,null,null,null,null,null,null,null,null,null,null,"LENGUAZAQUE"]
[null,null,null,null,null,null,null,null,null,null,null,null,null,null,null,null,null,null,null,null,null,null,null,null,null,null,null,null,null,null,null,null,null,null,null,null,null,null,null,null,null,null,null,null,null,null,null,null,null,null,null,null,null,null,null,null,null,null,null,null,null,null,null,null,null,null,null,null,null,null,"MACHETA"]
[null,null,null,null,null,null,null,null,null,null,null,null,null,null,null,null,null,null,null,null,null,null,null,null,null,null,null,null,null,null,null,null,null,null,null,null,null,null,null,null,null,null,null,null,null,null,null,null,null,null,null,null,null,null,null,null,null,null,null,null,null,null,null,null,null,null,null,null,null,null,"MADRID"]
[null,null,null,null,null,null,null,null,null,null,null,null,null,null,null,null,null,null,null,null,null,null,null,null,null,null,null,null,null,null,null,null,null,null,null,null,null,null,null,null,null,null,null,null,null,null,null,null,null,null,null,null,null,null,null,null,null,null,null,null,null,null,null,null,null,null,null,null,null,null,"MANTA"]
[null,null,null,null,null,null,null,null,null,null,null,null,null,null,null,null,null,null,null,null,null,null,null,null,null,null,null,null,null,null,null,null,null,null,null,null,null,null,null,null,null,null,null,null,null,null,null,null,null,null,null,null,null,null,null,null,null,null,null,null,null,null,null,null,null,null,null,null,null,null,"MEDINA"]
[null,null,null,null,null,null,null,null,null,null,null,null,null,null,null,null,null,null,null,null,null,null,null,null,null,null,null,null,null,null,null,null,null,null,null,null,null,null,null,null,null,null,null,null,null,null,null,null,null,null,null,null,null,null,null,null,null,null,null,null,null,null,null,null,null,null,null,null,null,null,"MOSQUERA"]
[null,null,null,null,null,null,null,null,null,null,null,null,null,null,null,null,null,null,null,null,null,null,null,null,null,null,null,null,null,null,null,null,null,null,null,null,null,null,null,null,null,null,null,null,null,null,null,null,null,null,null,null,null,null,null,null,null,null,null,null,null,null,null,null,null,null,null,null,null,null,"NARIÑO"]
[null,null,null,null,null,null,null,null,null,null,null,null,null,null,null,null,null,null,null,null,null,null,null,null,null,null,null,null,null,null,null,null,null,null,null,null,null,null,null,null,null,null,null,null,null,null,null,null,null,null,null,null,null,null,null,null,null,null,null,null,null,null,null,null,null,null,null,null,null,null,"NEMOCON"]
[null,null,null,null,null,null,null,null,null,null,null,null,null,null,null,null,null,null,null,null,null,null,null,null,null,null,null,null,null,null,null,null,null,null,null,null,null,null,null,null,null,null,null,null,null,null,null,null,null,null,null,null,null,null,null,null,null,null,null,null,null,null,null,null,null,null,null,null,null,null,"NILO"]
[null,null,null,null,null,null,null,null,null,null,null,null,null,null,null,null,null,null,null,null,null,null,null,null,null,null,null,null,null,null,null,null,null,null,null,null,null,null,null,null,null,null,null,null,null,null,null,null,null,null,null,null,null,null,null,null,null,null,null,null,null,null,null,null,null,null,null,null,null,null,"NIMAIMA"]
[null,null,null,null,null,null,null,null,null,null,null,null,null,null,null,null,null,null,null,null,null,null,null,null,null,null,null,null,null,null,null,null,null,null,null,null,null,null,null,null,null,null,null,null,null,null,null,null,null,null,null,null,null,null,null,null,null,null,null,null,null,null,null,null,null,null,null,null,null,null,"NOCAIMA"]
[null,null,null,null,null,null,null,null,null,null,null,null,null,null,null,null,null,null,null,null,null,null,null,null,null,null,null,null,null,null,null,null,null,null,null,null,null,null,null,null,null,null,null,null,null,null,null,null,null,null,null,null,null,null,null,null,null,null,null,null,null,null,null,null,null,null,null,null,null,null,"PACHO"]
[null,null,null,null,null,null,null,null,null,null,null,null,null,null,null,null,null,null,null,null,null,null,null,null,null,null,null,null,null,null,null,null,null,null,null,null,null,null,null,null,null,null,null,null,null,null,null,null,null,null,null,null,null,null,null,null,null,null,null,null,null,null,null,null,null,null,null,null,null,null,"PAIME"]
[null,null,null,null,null,null,null,null,null,null,null,null,null,null,null,null,null,null,null,null,null,null,null,null,null,null,null,null,null,null,null,null,null,null,null,null,null,null,null,null,null,null,null,null,null,null,null,null,null,null,null,null,null,null,null,null,null,null,null,null,null,null,null,null,null,null,null,null,null,null,"PANDI"]
[null,null,null,null,null,null,null,null,null,null,null,null,null,null,null,null,null,null,null,null,null,null,null,null,null,null,null,null,null,null,null,null,null,null,null,null,null,null,null,null,null,null,null,null,null,null,null,null,null,null,null,null,null,null,null,null,null,null,null,null,null,null,null,null,null,null,null,null,null,null,"PARATEBUENO"]
[null,null,null,null,null,null,null,null,null,null,null,null,null,null,null,null,null,null,null,null,null,null,null,null,null,null,null,null,null,null,null,null,null,null,null,null,null,null,null,null,null,null,null,null,null,null,null,null,null,null,null,null,null,null,null,null,null,null,null,null,null,null,null,null,null,null,null,null,null,null,"PASCA"]
[null,null,null,null,null,null,null,null,null,null,null,null,null,null,null,null,null,null,null,null,null,null,null,null,null,null,null,null,null,null,null,null,null,null,null,null,null,null,null,null,null,null,null,null,null,null,null,null,null,null,null,null,null,null,null,null,null,null,null,null,null,null,null,null,null,null,null,null,null,null,"PUERTO SALGAR"]
[null,null,null,null,null,null,null,null,null,null,null,null,null,null,null,null,null,null,null,null,null,null,null,null,null,null,null,null,null,null,null,null,null,null,null,null,null,null,null,null,null,null,null,null,null,null,null,null,null,null,null,null,null,null,null,null,null,null,null,null,null,null,null,null,null,null,null,null,null,null,"PULI"]
[null,null,null,null,null,null,null,null,null,null,null,null,null,null,null,null,null,null,null,null,null,null,null,null,null,null,null,null,null,null,null,null,null,null,null,null,null,null,null,null,null,null,null,null,null,null,null,null,null,null,null,null,null,null,null,null,null,null,null,null,null,null,null,null,null,null,null,null,null,null,"QUEBRADANEGRA"]
[null,null,null,null,null,null,null,null,null,null,null,null,null,null,null,null,null,null,null,null,null,null,null,null,null,null,null,null,null,null,null,null,null,null,null,null,null,null,null,null,null,null,null,null,null,null,null,null,null,null,null,null,null,null,null,null,null,null,null,null,null,null,null,null,null,null,null,null,null,null,"QUETAME"]
[null,null,null,null,null,null,null,null,null,null,null,null,null,null,null,null,null,null,null,null,null,null,null,null,null,null,null,null,null,null,null,null,null,null,null,null,null,null,null,null,null,null,null,null,null,null,null,null,null,null,null,null,null,null,null,null,null,null,null,null,null,null,null,null,null,null,null,null,null,null,"QUIPILE"]
[null,null,null,null,null,null,null,null,null,null,null,null,null,null,null,null,null,null,null,null,null,null,null,null,null,null,null,null,null,null,null,null,null,null,null,null,null,null,null,null,null,null,null,null,null,null,null,null,null,null,null,null,null,null,null,null,null,null,null,null,null,null,null,null,null,null,null,null,null,null,"RICAURTE"]
[null,null,null,null,null,null,null,null,null,null,null,null,null,null,null,null,null,null,null,null,null,null,null,null,null,null,null,null,null,null,null,null,null,null,null,null,null,null,null,null,null,null,null,null,null,null,null,null,null,null,null,null,null,null,null,null,null,null,null,null,null,null,null,null,null,null,null,null,null,null,"SAN ANTONIO DEL TEQUENDAMA"]
[null,null,null,null,null,null,null,null,null,null,null,null,null,null,null,null,null,null,null,null,null,null,null,null,null,null,null,null,null,null,null,null,null,null,null,null,null,null,null,null,null,null,null,null,null,null,null,null,null,null,null,null,null,null,null,null,null,null,null,null,null,null,null,null,null,null,null,null,null,null,"SAN BERNARDO"]
[null,null,null,null,null,null,null,null,null,null,null,null,null,null,null,null,null,null,null,null,null,null,null,null,null,null,null,null,null,null,null,null,null,null,null,null,null,null,null,null,null,null,null,null,null,null,null,null,null,null,null,null,null,null,null,null,null,null,null,null,null,null,null,null,null,null,null,null,null,null,"SAN CAYETANO"]
[null,null,null,null,null,null,null,null,null,null,null,null,null,null,null,null,null,null,null,null,null,null,null,null,null,null,null,null,null,null,null,null,null,null,null,null,null,null,null,null,null,null,null,null,null,null,null,null,null,null,null,null,null,null,null,null,null,null,null,null,null,null,null,null,null,null,null,null,null,null,"SAN FRANCISCO"]
[null,null,null,null,null,null,null,null,null,null,null,null,null,null,null,null,null,null,null,null,null,null,null,null,null,null,null,null,null,null,null,null,null,null,null,null,null,null,null,null,null,null,null,null,null,null,null,null,null,null,null,null,null,null,null,null,null,null,null,null,null,null,null,null,null,null,null,null,null,null,"SAN JUAN DE RIO SECO"]
[null,null,null,null,null,null,null,null,null,null,null,null,null,null,null,null,null,null,null,null,null,null,null,null,null,null,null,null,null,null,null,null,null,null,null,null,null,null,null,null,null,null,null,null,null,null,null,null,null,null,null,null,null,null,null,null,null,null,null,null,null,null,null,null,null,null,null,null,null,null,"SASAIMA"]
[null,null,null,null,null,null,null,null,null,null,null,null,null,null,null,null,null,null,null,null,null,null,null,null,null,null,null,null,null,null,null,null,null,null,null,null,null,null,null,null,null,null,null,null,null,null,null,null,null,null,null,null,null,null,null,null,null,null,null,null,null,null,null,null,null,null,null,null,null,null,"SESQUILE"]
[null,null,null,null,null,null,null,null,null,null,null,null,null,null,null,null,null,null,null,null,null,null,null,null,null,null,null,null,null,null,null,null,null,null,null,null,null,null,null,null,null,null,null,null,null,null,null,null,null,null,null,null,null,null,null,null,null,null,null,null,null,null,null,null,null,null,null,null,null,null,"SIBATE"]
[null,null,null,null,null,null,null,null,null,null,null,null,null,null,null,null,null,null,null,null,null,null,null,null,null,null,null,null,null,null,null,null,null,null,null,null,null,null,null,null,null,null,null,null,null,null,null,null,null,null,null,null,null,null,null,null,null,null,null,null,null,null,null,null,null,null,null,null,null,null,"SILVANIA"]
[null,null,null,null,null,null,null,null,null,null,null,null,null,null,null,null,null,null,null,null,null,null,null,null,null,null,null,null,null,null,null,null,null,null,null,null,null,null,null,null,null,null,null,null,null,null,null,null,null,null,null,null,null,null,null,null,null,null,null,null,null,null,null,null,null,null,null,null,null,null,"SIMIJACA"]
[null,null,null,null,null,null,null,null,null,null,null,null,null,null,null,null,null,null,null,null,null,null,null,null,null,null,null,null,null,null,null,null,null,null,null,null,null,null,null,null,null,null,null,null,null,null,null,null,null,null,null,null,null,null,null,null,null,null,null,null,null,null,null,null,null,null,null,null,null,null,"SOACHA"]
[null,null,null,null,null,null,null,null,null,null,null,null,null,null,null,null,null,null,null,null,null,null,null,null,null,null,null,null,null,null,null,null,null,null,null,null,null,null,null,null,null,null,null,null,null,null,null,null,null,null,null,null,null,null,null,null,null,null,null,null,null,null,null,null,null,null,null,null,null,null,"SOPO"]
[null,null,null,null,null,null,null,null,null,null,null,null,null,null,null,null,null,null,null,null,null,null,null,null,null,null,null,null,null,null,null,null,null,null,null,null,null,null,null,null,null,null,null,null,null,null,null,null,null,null,null,null,null,null,null,null,null,null,null,null,null,null,null,null,null,null,null,null,null,null,"SUBACHOQUE"]
[null,null,null,null,null,null,null,null,null,null,null,null,null,null,null,null,null,null,null,null,null,null,null,null,null,null,null,null,null,null,null,null,null,null,null,null,null,null,null,null,null,null,null,null,null,null,null,null,null,null,null,null,null,null,null,null,null,null,null,null,null,null,null,null,null,null,null,null,null,null,"SUESCA"]
[null,null,null,null,null,null,null,null,null,null,null,null,null,null,null,null,null,null,null,null,null,null,null,null,null,null,null,null,null,null,null,null,null,null,null,null,null,null,null,null,null,null,null,null,null,null,null,null,null,null,null,null,null,null,null,null,null,null,null,null,null,null,null,null,null,null,null,null,null,null,"SUPATA"]
[null,null,null,null,null,null,null,null,null,null,null,null,null,null,null,null,null,null,null,null,null,null,null,null,null,null,null,null,null,null,null,null,null,null,null,null,null,null,null,null,null,null,null,null,null,null,null,null,null,null,null,null,null,null,null,null,null,null,null,null,null,null,null,null,null,null,null,null,null,null,"SUSA"]
[null,null,null,null,null,null,null,null,null,null,null,null,null,null,null,null,null,null,null,null,null,null,null,null,null,null,null,null,null,null,null,null,null,null,null,null,null,null,null,null,null,null,null,null,null,null,null,null,null,null,null,null,null,null,null,null,null,null,null,null,null,null,null,null,null,null,null,null,null,null,"SUTATAUSA"]
[null,null,null,null,null,null,null,null,null,null,null,null,null,null,null,null,null,null,null,null,null,null,null,null,null,null,null,null,null,null,null,null,null,null,null,null,null,null,null,null,null,null,null,null,null,null,null,null,null,null,null,null,null,null,null,null,null,null,null,null,null,null,null,null,null,null,null,null,null,null,"TABIO"]
[null,null,null,null,null,null,null,null,null,null,null,null,null,null,null,null,null,null,null,null,null,null,null,null,null,null,null,null,null,null,null,null,null,null,null,null,null,null,null,null,null,null,null,null,null,null,null,null,null,null,null,null,null,null,null,null,null,null,null,null,null,null,null,null,null,null,null,null,null,null,"TAUSA"]
[null,null,null,null,null,null,null,null,null,null,null,null,null,null,null,null,null,null,null,null,null,null,null,null,null,null,null,null,null,null,null,null,null,null,null,null,null,null,null,null,null,null,null,null,null,null,null,null,null,null,null,null,null,null,null,null,null,null,null,null,null,null,null,null,null,null,null,null,null,null,"TENA"]
[null,null,null,null,null,null,null,null,null,null,null,null,null,null,null,null,null,null,null,null,null,null,null,null,null,null,null,null,null,null,null,null,null,null,null,null,null,null,null,null,null,null,null,null,null,null,null,null,null,null,null,null,null,null,null,null,null,null,null,null,null,null,null,null,null,null,null,null,null,null,"TENJO"]
[null,null,null,null,null,null,null,null,null,null,null,null,null,null,null,null,null,null,null,null,null,null,null,null,null,null,null,null,null,null,null,null,null,null,null,null,null,null,null,null,null,null,null,null,null,null,null,null,null,null,null,null,null,null,null,null,null,null,null,null,null,null,null,null,null,null,null,null,null,null,"TIBACUY"]
[null,null,null,null,null,null,null,null,null,null,null,null,null,null,null,null,null,null,null,null,null,null,null,null,null,null,null,null,null,null,null,null,null,null,null,null,null,null,null,null,null,null,null,null,null,null,null,null,null,null,null,null,null,null,null,null,null,null,null,null,null,null,null,null,null,null,null,null,null,null,"TIBIRITA"]
[null,null,null,null,null,null,null,null,null,null,null,null,null,null,null,null,null,null,null,null,null,null,null,null,null,null,null,null,null,null,null,null,null,null,null,null,null,null,null,null,null,null,null,null,null,null,null,null,null,null,null,null,null,null,null,null,null,null,null,null,null,null,null,null,null,null,null,null,null,null,"TOCAIMA"]
[null,null,null,null,null,null,null,null,null,null,null,null,null,null,null,null,null,null,null,null,null,null,null,null,null,null,null,null,null,null,null,null,null,null,null,null,null,null,null,null,null,null,null,null,null,null,null,null,null,null,null,null,null,null,null,null,null,null,null,null,null,null,null,null,null,null,null,null,null,null,"TOCANCIPA"]
[null,null,null,null,null,null,null,null,null,null,null,null,null,null,null,null,null,null,null,null,null,null,null,null,null,null,null,null,null,null,null,null,null,null,null,null,null,null,null,null,null,null,null,null,null,null,null,null,null,null,null,null,null,null,null,null,null,null,null,null,null,null,null,null,null,null,null,null,null,null,"TOPAIPI"]
[null,null,null,null,null,null,null,null,null,null,null,null,null,null,null,null,null,null,null,null,null,null,null,null,null,null,null,null,null,null,null,null,null,null,null,null,null,null,null,null,null,null,null,null,null,null,null,null,null,null,null,null,null,null,null,null,null,null,null,null,null,null,null,null,null,null,null,null,null,null,"UBALA"]
[null,null,null,null,null,null,null,null,null,null,null,null,null,null,null,null,null,null,null,null,null,null,null,null,null,null,null,null,null,null,null,null,null,null,null,null,null,null,null,null,null,null,null,null,null,null,null,null,null,null,null,null,null,null,null,null,null,null,null,null,null,null,null,null,null,null,null,null,null,null,"UBAQUE"]
[null,null,null,null,null,null,null,null,null,null,null,null,null,null,null,null,null,null,null,null,null,null,null,null,null,null,null,null,null,null,null,null,null,null,null,null,null,null,null,null,null,null,null,null,null,null,null,null,null,null,null,null,null,null,null,null,null,null,null,null,null,null,null,null,null,null,null,null,null,null,"UNE"]
[null,null,null,null,null,null,null,null,null,null,null,null,null,null,null,null,null,null,null,null,null,null,null,null,null,null,null,null,null,null,null,null,null,null,null,null,null,null,null,null,null,null,null,null,null,null,null,null,null,null,null,null,null,null,null,null,null,null,null,null,null,null,null,null,null,null,null,null,null,null,"UTICA"]
[null,null,null,null,null,null,null,null,null,null,null,null,null,null,null,null,null,null,null,null,null,null,null,null,null,null,null,null,null,null,null,null,null,null,null,null,null,null,null,null,null,null,null,null,null,null,null,null,null,null,null,null,null,null,null,null,null,null,null,null,null,null,null,null,null,null,null,null,null,null,"VENECIA"]
[null,null,null,null,null,null,null,null,null,null,null,null,null,null,null,null,null,null,null,null,null,null,null,null,null,null,null,null,null,null,null,null,null,null,null,null,null,null,null,null,null,null,null,null,null,null,null,null,null,null,null,null,null,null,null,null,null,null,null,null,null,null,null,null,null,null,null,null,null,null,"VERGARA"]
[null,null,null,null,null,null,null,null,null,null,null,null,null,null,null,null,null,null,null,null,null,null,null,null,null,null,null,null,null,null,null,null,null,null,null,null,null,null,null,null,null,null,null,null,null,null,null,null,null,null,null,null,null,null,null,null,null,null,null,null,null,null,null,null,null,null,null,null,null,null,"VIANI"]
[null,null,null,null,null,null,null,null,null,null,null,null,null,null,null,null,null,null,null,null,null,null,null,null,null,null,null,null,null,null,null,null,null,null,null,null,null,null,null,null,null,null,null,null,null,null,null,null,null,null,null,null,null,null,null,null,null,null,null,null,null,null,null,null,null,null,null,null,null,null,"VILLA DE SAN DIEGO DE UBATE"]
[null,null,null,null,null,null,null,null,null,null,null,null,null,null,null,null,null,null,null,null,null,null,null,null,null,null,null,null,null,null,null,null,null,null,null,null,null,null,null,null,null,null,null,null,null,null,null,null,null,null,null,null,null,null,null,null,null,null,null,null,null,null,null,null,null,null,null,null,null,null,"VILLAGOMEZ"]
[null,null,null,null,null,null,null,null,null,null,null,null,null,null,null,null,null,null,null,null,null,null,null,null,null,null,null,null,null,null,null,null,null,null,null,null,null,null,null,null,null,null,null,null,null,null,null,null,null,null,null,null,null,null,null,null,null,null,null,null,null,null,null,null,null,null,null,null,null,null,"VILLAPINZON"]
[null,null,null,null,null,null,null,null,null,null,null,null,null,null,null,null,null,null,null,null,null,null,null,null,null,null,null,null,null,null,null,null,null,null,null,null,null,null,null,null,null,null,null,null,null,null,null,null,null,null,null,null,null,null,null,null,null,null,null,null,null,null,null,null,null,null,null,null,null,null,"VILLETA"]
[null,null,null,null,null,null,null,null,null,null,null,null,null,null,null,null,null,null,null,null,null,null,null,null,null,null,null,null,null,null,null,null,null,null,null,null,null,null,null,null,null,null,null,null,null,null,null,null,null,null,null,null,null,null,null,null,null,null,null,null,null,null,null,null,null,null,null,null,null,null,"VIOTA"]
[null,null,null,null,null,null,null,null,null,null,null,null,null,null,null,null,null,null,null,null,null,null,null,null,null,null,null,null,null,null,null,null,null,null,null,null,null,null,null,null,null,null,null,null,null,null,null,null,null,null,null,null,null,null,null,null,null,null,null,null,null,null,null,null,null,null,null,null,null,null,"YACOPI"]
[null,null,null,null,null,null,null,null,null,null,null,null,null,null,null,null,null,null,null,null,null,null,null,null,null,null,null,null,null,null,null,null,null,null,null,null,null,null,null,null,null,null,null,null,null,null,null,null,null,null,null,null,null,null,null,null,null,null,null,null,null,null,null,null,null,null,null,null,null,null,"ZIPACON"]
[null,null,null,null,null,null,null,null,null,null,null,null,null,null,null,null,null,null,null,null,null,null,null,null,null,null,null,null,null,null,null,null,null,null,null,null,null,null,null,null,null,null,null,null,null,null,null,null,null,null,null,null,null,null,null,null,null,null,null,null,null,null,null,null,null,null,null,null,null,null,"ZIPAQUIRA"]
[null,null,null,null,null,null,null,null,null,null,null,null,null,null,null,null,null,null,null,null,null,null,null,null,null,null,null,null,null,null,null,null,null,null,null,null,null,null,null,null,null,null,null,null,null,null,null,null,null,null,null,null,null,null,null,null,null,null,null,null,null,null,null,null,null,null,null,null,null,null,"BARRANCO MINAS"]
[null,null,null,null,null,null,null,null,null,null,null,null,null,null,null,null,null,null,null,null,null,null,null,null,null,null,null,null,null,null,null,null,null,null,null,null,null,null,null,null,null,null,null,null,null,null,null,null,null,null,null,null,null,null,null,null,null,null,null,null,null,null,null,null,null,null,null,null,null,null,"CACAHUAL"]
[null,null,null,null,null,null,null,null,null,null,null,null,null,null,null,null,null,null,null,null,null,null,null,null,null,null,null,null,null,null,null,null,null,null,null,null,null,null,null,null,null,null,null,null,null,null,null,null,null,null,null,null,null,null,null,null,null,null,null,null,null,null,null,null,null,null,null,null,null,null,"INIRIDA"]
[null,null,null,null,null,null,null,null,null,null,null,null,null,null,null,null,null,null,null,null,null,null,null,null,null,null,null,null,null,null,null,null,null,null,null,null,null,null,null,null,null,null,null,null,null,null,null,null,null,null,null,null,null,null,null,null,null,null,null,null,null,null,null,null,null,null,null,null,null,null,"LA GUADALUPE"]
[null,null,null,null,null,null,null,null,null,null,null,null,null,null,null,null,null,null,null,null,null,null,null,null,null,null,null,null,null,null,null,null,null,null,null,null,null,null,null,null,null,null,null,null,null,null,null,null,null,null,null,null,null,null,null,null,null,null,null,null,null,null,null,null,null,null,null,null,null,null,"MAPIRIPANA"]
[null,null,null,null,null,null,null,null,null,null,null,null,null,null,null,null,null,null,null,null,null,null,null,null,null,null,null,null,null,null,null,null,null,null,null,null,null,null,null,null,null,null,null,null,null,null,null,null,null,null,null,null,null,null,null,null,null,null,null,null,null,null,null,null,null,null,null,null,null,null,"MORICHAL"]
[null,null,null,null,null,null,null,null,null,null,null,null,null,null,null,null,null,null,null,null,null,null,null,null,null,null,null,null,null,null,null,null,null,null,null,null,null,null,null,null,null,null,null,null,null,null,null,null,null,null,null,null,null,null,null,null,null,null,null,null,null,null,null,null,null,null,null,null,null,null,"PANA PANA"]
[null,null,null,null,null,null,null,null,null,null,null,null,null,null,null,null,null,null,null,null,null,null,null,null,null,null,null,null,null,null,null,null,null,null,null,null,null,null,null,null,null,null,null,null,null,null,null,null,null,null,null,null,null,null,null,null,null,null,null,null,null,null,null,null,null,null,null,null,null,null,"PUERTO COLOMBIA"]
[null,null,null,null,null,null,null,null,null,null,null,null,null,null,null,null,null,null,null,null,null,null,null,null,null,null,null,null,null,null,null,null,null,null,null,null,null,null,null,null,null,null,null,null,null,null,null,null,null,null,null,null,null,null,null,null,null,null,null,null,null,null,null,null,null,null,null,null,null,null,"SAN FELIPE"]
[null,null,null,null,null,null,null,null,null,null,null,null,null,null,null,null,null,null,null,null,null,null,null,null,null,null,null,null,null,null,null,null,null,null,null,null,null,null,null,null,null,null,null,null,null,null,null,null,null,null,null,null,null,null,null,null,null,null,null,null,null,null,null,null,null,null,null,null,null,null,"CALAMAR"]
[null,null,null,null,null,null,null,null,null,null,null,null,null,null,null,null,null,null,null,null,null,null,null,null,null,null,null,null,null,null,null,null,null,null,null,null,null,null,null,null,null,null,null,null,null,null,null,null,null,null,null,null,null,null,null,null,null,null,null,null,null,null,null,null,null,null,null,null,null,null,"EL RETORNO"]
[null,null,null,null,null,null,null,null,null,null,null,null,null,null,null,null,null,null,null,null,null,null,null,null,null,null,null,null,null,null,null,null,null,null,null,null,null,null,null,null,null,null,null,null,null,null,null,null,null,null,null,null,null,null,null,null,null,null,null,null,null,null,null,null,null,null,null,null,null,null,"MIRAFLORES"]
[null,null,null,null,null,null,null,null,null,null,null,null,null,null,null,null,null,null,null,null,null,null,null,null,null,null,null,null,null,null,null,null,null,null,null,null,null,null,null,null,null,null,null,null,null,null,null,null,null,null,null,null,null,null,null,null,null,null,null,null,null,null,null,null,null,null,null,null,null,null,"SAN JOSE DEL GUAVIARE"]
[null,null,null,null,null,null,null,null,null,null,null,null,null,null,null,null,null,null,null,null,null,null,null,null,null,null,null,null,null,null,null,null,null,null,null,null,null,null,null,null,null,null,null,null,null,null,null,null,null,null,null,null,null,null,null,null,null,null,null,null,null,null,null,null,null,null,null,null,null,null,"ACEVEDO"]
[null,null,null,null,null,null,null,null,null,null,null,null,null,null,null,null,null,null,null,null,null,null,null,null,null,null,null,null,null,null,null,null,null,null,null,null,null,null,null,null,null,null,null,null,null,null,null,null,null,null,null,null,null,null,null,null,null,null,null,null,null,null,null,null,null,null,null,null,null,null,"AGRADO"]
[null,null,null,null,null,null,null,null,null,null,null,null,null,null,null,null,null,null,null,null,null,null,null,null,null,null,null,null,null,null,null,null,null,null,null,null,null,null,null,null,null,null,null,null,null,null,null,null,null,null,null,null,null,null,null,null,null,null,null,null,null,null,null,null,null,null,null,null,null,null,"AIPE"]
[null,null,null,null,null,null,null,null,null,null,null,null,null,null,null,null,null,null,null,null,null,null,null,null,null,null,null,null,null,null,null,null,null,null,null,null,null,null,null,null,null,null,null,null,null,null,null,null,null,null,null,null,null,null,null,null,null,null,null,null,null,null,null,null,null,null,null,null,null,null,"ALGECIRAS"]
[null,null,null,null,null,null,null,null,null,null,null,null,null,null,null,null,null,null,null,null,null,null,null,null,null,null,null,null,null,null,null,null,null,null,null,null,null,null,null,null,null,null,null,null,null,null,null,null,null,null,null,null,null,null,null,null,null,null,null,null,null,null,null,null,null,null,null,null,null,null,"ALTAMIRA"]
[null,null,null,null,null,null,null,null,null,null,null,null,null,null,null,null,null,null,null,null,null,null,null,null,null,null,null,null,null,null,null,null,null,null,null,null,null,null,null,null,null,null,null,null,null,null,null,null,null,null,null,null,null,null,null,null,null,null,null,null,null,null,null,null,null,null,null,null,null,null,"BARAYA"]
[null,null,null,null,null,null,null,null,null,null,null,null,null,null,null,null,null,null,null,null,null,null,null,null,null,null,null,null,null,null,null,null,null,null,null,null,null,null,null,null,null,null,null,null,null,null,null,null,null,null,null,null,null,null,null,null,null,null,null,null,null,null,null,null,null,null,null,null,null,null,"CAMPOALEGRE"]
[null,null,null,null,null,null,null,null,null,null,null,null,null,null,null,null,null,null,null,null,null,null,null,null,null,null,null,null,null,null,null,null,null,null,null,null,null,null,null,null,null,null,null,null,null,null,null,null,null,null,null,null,null,null,null,null,null,null,null,null,null,null,null,null,null,null,null,null,null,null,"COLOMBIA"]
[null,null,null,null,null,null,null,null,null,null,null,null,null,null,null,null,null,null,null,null,null,null,null,null,null,null,null,null,null,null,null,null,null,null,null,null,null,null,null,null,null,null,null,null,null,null,null,null,null,null,null,null,null,null,null,null,null,null,null,null,null,null,null,null,null,null,null,null,null,null,"ELIAS"]
[null,null,null,null,null,null,null,null,null,null,null,null,null,null,null,null,null,null,null,null,null,null,null,null,null,null,null,null,null,null,null,null,null,null,null,null,null,null,null,null,null,null,null,null,null,null,null,null,null,null,null,null,null,null,null,null,null,null,null,null,null,null,null,null,null,null,null,null,null,null,"GARZON"]
[null,null,null,null,null,null,null,null,null,null,null,null,null,null,null,null,null,null,null,null,null,null,null,null,null,null,null,null,null,null,null,null,null,null,null,null,null,null,null,null,null,null,null,null,null,null,null,null,null,null,null,null,null,null,null,null,null,null,null,null,null,null,null,null,null,null,null,null,null,null,"GIGANTE"]
[null,null,null,null,null,null,null,null,null,null,null,null,null,null,null,null,null,null,null,null,null,null,null,null,null,null,null,null,null,null,null,null,null,null,null,null,null,null,null,null,null,null,null,null,null,null,null,null,null,null,null,null,null,null,null,null,null,null,null,null,null,null,null,null,null,null,null,null,null,null,"GUADALUPE"]
[null,null,null,null,null,null,null,null,null,null,null,null,null,null,null,null,null,null,null,null,null,null,null,null,null,null,null,null,null,null,null,null,null,null,null,null,null,null,null,null,null,null,null,null,null,null,null,null,null,null,null,null,null,null,null,null,null,null,null,null,null,null,null,null,null,null,null,null,null,null,"HOBO"]
[null,null,null,null,null,null,null,null,null,null,null,null,null,null,null,null,null,null,null,null,null,null,null,null,null,null,null,null,null,null,null,null,null,null,null,null,null,null,null,null,null,null,null,null,null,null,null,null,null,null,null,null,null,null,null,null,null,null,null,null,null,null,null,null,null,null,null,null,null,null,"IQUIRA"]
[null,null,null,null,null,null,null,null,null,null,null,null,null,null,null,null,null,null,null,null,null,null,null,null,null,null,null,null,null,null,null,null,null,null,null,null,null,null,null,null,null,null,null,null,null,null,null,null,null,null,null,null,null,null,null,null,null,null,null,null,null,null,null,null,null,null,null,null,null,null,"ISNOS"]
[null,null,null,null,null,null,null,null,null,null,null,null,null,null,null,null,null,null,null,null,null,null,null,null,null,null,null,null,null,null,null,null,null,null,null,null,null,null,null,null,null,null,null,null,null,null,null,null,null,null,null,null,null,null,null,null,null,null,null,null,null,null,null,null,null,null,null,null,null,null,"LA ARGENTINA"]
[null,null,null,null,null,null,null,null,null,null,null,null,null,null,null,null,null,null,null,null,null,null,null,null,null,null,null,null,null,null,null,null,null,null,null,null,null,null,null,null,null,null,null,null,null,null,null,null,null,null,null,null,null,null,null,null,null,null,null,null,null,null,null,null,null,null,null,null,null,null,"LA PLATA"]
[null,null,null,null,null,null,null,null,null,null,null,null,null,null,null,null,null,null,null,null,null,null,null,null,null,null,null,null,null,null,null,null,null,null,null,null,null,null,null,null,null,null,null,null,null,null,null,null,null,null,null,null,null,null,null,null,null,null,null,null,null,null,null,null,null,null,null,null,null,null,"NATAGA"]
[null,null,null,null,null,null,null,null,null,null,null,null,null,null,null,null,null,null,null,null,null,null,null,null,null,null,null,null,null,null,null,null,null,null,null,null,null,null,null,null,null,null,null,null,null,null,null,null,null,null,null,null,null,null,null,null,null,null,null,null,null,null,null,null,null,null,null,null,null,null,"NEIVA"]
[null,null,null,null,null,null,null,null,null,null,null,null,null,null,null,null,null,null,null,null,null,null,null,null,null,null,null,null,null,null,null,null,null,null,null,null,null,null,null,null,null,null,null,null,null,null,null,null,null,null,null,null,null,null,null,null,null,null,null,null,null,null,null,null,null,null,null,null,null,null,"OPORAPA"]
[null,null,null,null,null,null,null,null,null,null,null,null,null,null,null,null,null,null,null,null,null,null,null,null,null,null,null,null,null,null,null,null,null,null,null,null,null,null,null,null,null,null,null,null,null,null,null,null,null,null,null,null,null,null,null,null,null,null,null,null,null,null,null,null,null,null,null,null,null,null,"PAICOL"]
[null,null,null,null,null,null,null,null,null,null,null,null,null,null,null,null,null,null,null,null,null,null,null,null,null,null,null,null,null,null,null,null,null,null,null,null,null,null,null,null,null,null,null,null,null,null,null,null,null,null,null,null,null,null,null,null,null,null,null,null,null,null,null,null,null,null,null,null,null,null,"PALERMO"]
[null,null,null,null,null,null,null,null,null,null,null,null,null,null,null,null,null,null,null,null,null,null,null,null,null,null,null,null,null,null,null,null,null,null,null,null,null,null,null,null,null,null,null,null,null,null,null,null,null,null,null,null,null,null,null,null,null,null,null,null,null,null,null,null,null,null,null,null,null,null,"PALESTINA"]
[null,null,null,null,null,null,null,null,null,null,null,null,null,null,null,null,null,null,null,null,null,null,null,null,null,null,null,null,null,null,null,null,null,null,null,null,null,null,null,null,null,null,null,null,null,null,null,null,null,null,null,null,null,null,null,null,null,null,null,null,null,null,null,null,null,null,null,null,null,null,"PITAL"]
[null,null,null,null,null,null,null,null,null,null,null,null,null,null,null,null,null,null,null,null,null,null,null,null,null,null,null,null,null,null,null,null,null,null,null,null,null,null,null,null,null,null,null,null,null,null,null,null,null,null,null,null,null,null,null,null,null,null,null,null,null,null,null,null,null,null,null,null,null,null,"PITALITO"]
[null,null,null,null,null,null,null,null,null,null,null,null,null,null,null,null,null,null,null,null,null,null,null,null,null,null,null,null,null,null,null,null,null,null,null,null,null,null,null,null,null,null,null,null,null,null,null,null,null,null,null,null,null,null,null,null,null,null,null,null,null,null,null,null,null,null,null,null,null,null,"RIVERA"]
[null,null,null,null,null,null,null,null,null,null,null,null,null,null,null,null,null,null,null,null,null,null,null,null,null,null,null,null,null,null,null,null,null,null,null,null,null,null,null,null,null,null,null,null,null,null,null,null,null,null,null,null,null,null,null,null,null,null,null,null,null,null,null,null,null,null,null,null,null,null,"SALADOBLANCO"]
[null,null,null,null,null,null,null,null,null,null,null,null,null,null,null,null,null,null,null,null,null,null,null,null,null,null,null,null,null,null,null,null,null,null,null,null,null,null,null,null,null,null,null,null,null,null,null,null,null,null,null,null,null,null,null,null,null,null,null,null,null,null,null,null,null,null,null,null,null,null,"SAN AGUSTIN"]
[null,null,null,null,null,null,null,null,null,null,null,null,null,null,null,null,null,null,null,null,null,null,null,null,null,null,null,null,null,null,null,null,null,null,null,null,null,null,null,null,null,null,null,null,null,null,null,null,null,null,null,null,null,null,null,null,null,null,null,null,null,null,null,null,null,null,null,null,null,null,"SANTA MARIA"]
[null,null,null,null,null,null,null,null,null,null,null,null,null,null,null,null,null,null,null,null,null,null,null,null,null,null,null,null,null,null,null,null,null,null,null,null,null,null,null,null,null,null,null,null,null,null,null,null,null,null,null,null,null,null,null,null,null,null,null,null,null,null,null,null,null,null,null,null,null,null,"SUAZA"]
[null,null,null,null,null,null,null,null,null,null,null,null,null,null,null,null,null,null,null,null,null,null,null,null,null,null,null,null,null,null,null,null,null,null,null,null,null,null,null,null,null,null,null,null,null,null,null,null,null,null,null,null,null,null,null,null,null,null,null,null,null,null,null,null,null,null,null,null,null,null,"TARQUI"]
[null,null,null,null,null,null,null,null,null,null,null,null,null,null,null,null,null,null,null,null,null,null,null,null,null,null,null,null,null,null,null,null,null,null,null,null,null,null,null,null,null,null,null,null,null,null,null,null,null,null,null,null,null,null,null,null,null,null,null,null,null,null,null,null,null,null,null,null,null,null,"TELLO"]
[null,null,null,null,null,null,null,null,null,null,null,null,null,null,null,null,null,null,null,null,null,null,null,null,null,null,null,null,null,null,null,null,null,null,null,null,null,null,null,null,null,null,null,null,null,null,null,null,null,null,null,null,null,null,null,null,null,null,null,null,null,null,null,null,null,null,null,null,null,null,"TERUEL"]
[null,null,null,null,null,null,null,null,null,null,null,null,null,null,null,null,null,null,null,null,null,null,null,null,null,null,null,null,null,null,null,null,null,null,null,null,null,null,null,null,null,null,null,null,null,null,null,null,null,null,null,null,null,null,null,null,null,null,null,null,null,null,null,null,null,null,null,null,null,null,"TESALIA"]
[null,null,null,null,null,null,null,null,null,null,null,null,null,null,null,null,null,null,null,null,null,null,null,null,null,null,null,null,null,null,null,null,null,null,null,null,null,null,null,null,null,null,null,null,null,null,null,null,null,null,null,null,null,null,null,null,null,null,null,null,null,null,null,null,null,null,null,null,null,null,"TIMANA"]
[null,null,null,null,null,null,null,null,null,null,null,null,null,null,null,null,null,null,null,null,null,null,null,null,null,null,null,null,null,null,null,null,null,null,null,null,null,null,null,null,null,null,null,null,null,null,null,null,null,null,null,null,null,null,null,null,null,null,null,null,null,null,null,null,null,null,null,null,null,null,"VILLAVIEJA"]
[null,null,null,null,null,null,null,null,null,null,null,null,null,null,null,null,null,null,null,null,null,null,null,null,null,null,null,null,null,null,null,null,null,null,null,null,null,null,null,null,null,null,null,null,null,null,null,null,null,null,null,null,null,null,null,null,null,null,null,null,null,null,null,null,null,null,null,null,null,null,"YAGUARA"]
[null,null,null,null,null,null,null,null,null,null,null,null,null,null,null,null,null,null,null,null,null,null,null,null,null,null,null,null,null,null,null,null,null,null,null,null,null,null,null,null,null,null,null,null,null,null,null,null,null,null,null,null,null,null,null,null,null,null,null,null,null,null,null,null,null,null,null,null,null,null,"ALBANIA"]
[null,null,null,null,null,null,null,null,null,null,null,null,null,null,null,null,null,null,null,null,null,null,null,null,null,null,null,null,null,null,null,null,null,null,null,null,null,null,null,null,null,null,null,null,null,null,null,null,null,null,null,null,null,null,null,null,null,null,null,null,null,null,null,null,null,null,null,null,null,null,"BARRANCAS"]
[null,null,null,null,null,null,null,null,null,null,null,null,null,null,null,null,null,null,null,null,null,null,null,null,null,null,null,null,null,null,null,null,null,null,null,null,null,null,null,null,null,null,null,null,null,null,null,null,null,null,null,null,null,null,null,null,null,null,null,null,null,null,null,null,null,null,null,null,null,null,"DIBULLA"]
[null,null,null,null,null,null,null,null,null,null,null,null,null,null,null,null,null,null,null,null,null,null,null,null,null,null,null,null,null,null,null,null,null,null,null,null,null,null,null,null,null,null,null,null,null,null,null,null,null,null,null,null,null,null,null,null,null,null,null,null,null,null,null,null,null,null,null,null,null,null,"DISTRACCION"]
[null,null,null,null,null,null,null,null,null,null,null,null,null,null,null,null,null,null,null,null,null,null,null,null,null,null,null,null,null,null,null,null,null,null,null,null,null,null,null,null,null,null,null,null,null,null,null,null,null,null,null,null,null,null,null,null,null,null,null,null,null,null,null,null,null,null,null,null,null,null,"EL MOLINO"]
[null,null,null,null,null,null,null,null,null,null,null,null,null,null,null,null,null,null,null,null,null,null,null,null,null,null,null,null,null,null,null,null,null,null,null,null,null,null,null,null,null,null,null,null,null,null,null,null,null,null,null,null,null,null,null,null,null,null,null,null,null,null,null,null,null,null,null,null,null,null,"FONSECA"]
[null,null,null,null,null,null,null,null,null,null,null,null,null,null,null,null,null,null,null,null,null,null,null,null,null,null,null,null,null,null,null,null,null,null,null,null,null,null,null,null,null,null,null,null,null,null,null,null,null,null,null,null,null,null,null,null,null,null,null,null,null,null,null,null,null,null,null,null,null,null,"HATONUEVO"]
[null,null,null,null,null,null,null,null,null,null,null,null,null,null,null,null,null,null,null,null,null,null,null,null,null,null,null,null,null,null,null,null,null,null,null,null,null,null,null,null,null,null,null,null,null,null,null,null,null,null,null,null,null,null,null,null,null,null,null,null,null,null,null,null,null,null,null,null,null,null,"LA JAGUA DEL PILAR"]
[null,null,null,null,null,null,null,null,null,null,null,null,null,null,null,null,null,null,null,null,null,null,null,null,null,null,null,null,null,null,null,null,null,null,null,null,null,null,null,null,null,null,null,null,null,null,null,null,null,null,null,null,null,null,null,null,null,null,null,null,null,null,null,null,null,null,null,null,null,null,"MAICAO"]
[null,null,null,null,null,null,null,null,null,null,null,null,null,null,null,null,null,null,null,null,null,null,null,null,null,null,null,null,null,null,null,null,null,null,null,null,null,null,null,null,null,null,null,null,null,null,null,null,null,null,null,null,null,null,null,null,null,null,null,null,null,null,null,null,null,null,null,null,null,null,"MANAURE"]
[null,null,null,null,null,null,null,null,null,null,null,null,null,null,null,null,null,null,null,null,null,null,null,null,null,null,null,null,null,null,null,null,null,null,null,null,null,null,null,null,null,null,null,null,null,null,null,null,null,null,null,null,null,null,null,null,null,null,null,null,null,null,null,null,null,null,null,null,null,null,"RIOHACHA"]
[null,null,null,null,null,null,null,null,null,null,null,null,null,null,null,null,null,null,null,null,null,null,null,null,null,null,null,null,null,null,null,null,null,null,null,null,null,null,null,null,null,null,null,null,null,null,null,null,null,null,null,null,null,null,null,null,null,null,null,null,null,null,null,null,null,null,null,null,null,null,"SAN JUAN DEL CESAR"]
[null,null,null,null,null,null,null,null,null,null,null,null,null,null,null,null,null,null,null,null,null,null,null,null,null,null,null,null,null,null,null,null,null,null,null,null,null,null,null,null,null,null,null,null,null,null,null,null,null,null,null,null,null,null,null,null,null,null,null,null,null,null,null,null,null,null,null,null,null,null,"URIBIA"]
[null,null,null,null,null,null,null,null,null,null,null,null,null,null,null,null,null,null,null,null,null,null,null,null,null,null,null,null,null,null,null,null,null,null,null,null,null,null,null,null,null,null,null,null,null,null,null,null,null,null,null,null,null,null,null,null,null,null,null,null,null,null,null,null,null,null,null,null,null,null,"URUMITA"]
[null,null,null,null,null,null,null,null,null,null,null,null,null,null,null,null,null,null,null,null,null,null,null,null,null,null,null,null,null,null,null,null,null,null,null,null,null,null,null,null,null,null,null,null,null,null,null,null,null,null,null,null,null,null,null,null,null,null,null,null,null,null,null,null,null,null,null,null,null,null,"VILLANUEVA"]
[null,null,null,null,null,null,null,null,null,null,null,null,null,null,null,null,null,null,null,null,null,null,null,null,null,null,null,null,null,null,null,null,null,null,null,null,null,null,null,null,null,null,null,null,null,null,null,null,null,null,null,null,null,null,null,null,null,null,null,null,null,null,null,null,null,null,null,null,null,null,"ALGARROBO"]
[null,null,null,null,null,null,null,null,null,null,null,null,null,null,null,null,null,null,null,null,null,null,null,null,null,null,null,null,null,null,null,null,null,null,null,null,null,null,null,null,null,null,null,null,null,null,null,null,null,null,null,null,null,null,null,null,null,null,null,null,null,null,null,null,null,null,null,null,null,null,"ARACATACA"]
[null,null,null,null,null,null,null,null,null,null,null,null,null,null,null,null,null,null,null,null,null,null,null,null,null,null,null,null,null,null,null,null,null,null,null,null,null,null,null,null,null,null,null,null,null,null,null,null,null,null,null,null,null,null,null,null,null,null,null,null,null,null,null,null,null,null,null,null,null,null,"ARIGUANI"]
[null,null,null,null,null,null,null,null,null,null,null,null,null,null,null,null,null,null,null,null,null,null,null,null,null,null,null,null,null,null,null,null,null,null,null,null,null,null,null,null,null,null,null,null,null,null,null,null,null,null,null,null,null,null,null,null,null,null,null,null,null,null,null,null,null,null,null,null,null,null,"CERRO SAN ANTONIO"]
[null,null,null,null,null,null,null,null,null,null,null,null,null,null,null,null,null,null,null,null,null,null,null,null,null,null,null,null,null,null,null,null,null,null,null,null,null,null,null,null,null,null,null,null,null,null,null,null,null,null,null,null,null,null,null,null,null,null,null,null,null,null,null,null,null,null,null,null,null,null,"CHIBOLO"]
[null,null,null,null,null,null,null,null,null,null,null,null,null,null,null,null,null,null,null,null,null,null,null,null,null,null,null,null,null,null,null,null,null,null,null,null,null,null,null,null,null,null,null,null,null,null,null,null,null,null,null,null,null,null,null,null,null,null,null,null,null,null,null,null,null,null,null,null,null,null,"CIENAGA"]
[null,null,null,null,null,null,null,null,null,null,null,null,null,null,null,null,null,null,null,null,null,null,null,null,null,null,null,null,null,null,null,null,null,null,null,null,null,null,null,null,null,null,null,null,null,null,null,null,null,null,null,null,null,null,null,null,null,null,null,null,null,null,null,null,null,null,null,null,null,null,"CONCORDIA"]
[null,null,null,null,null,null,null,null,null,null,null,null,null,null,null,null,null,null,null,null,null,null,null,null,null,null,null,null,null,null,null,null,null,null,null,null,null,null,null,null,null,null,null,null,null,null,null,null,null,null,null,null,null,null,null,null,null,null,null,null,null,null,null,null,null,null,null,null,null,null,"EL BANCO"]
[null,null,null,null,null,null,null,null,null,null,null,null,null,null,null,null,null,null,null,null,null,null,null,null,null,null,null,null,null,null,null,null,null,null,null,null,null,null,null,null,null,null,null,null,null,null,null,null,null,null,null,null,null,null,null,null,null,null,null,null,null,null,null,null,null,null,null,null,null,null,"EL PIÑON"]
[null,null,null,null,null,null,null,null,null,null,null,null,null,null,null,null,null,null,null,null,null,null,null,null,null,null,null,null,null,null,null,null,null,null,null,null,null,null,null,null,null,null,null,null,null,null,null,null,null,null,null,null,null,null,null,null,null,null,null,null,null,null,null,null,null,null,null,null,null,null,"EL RETEN"]
[null,null,null,null,null,null,null,null,null,null,null,null,null,null,null,null,null,null,null,null,null,null,null,null,null,null,null,null,null,null,null,null,null,null,null,null,null,null,null,null,null,null,null,null,null,null,null,null,null,null,null,null,null,null,null,null,null,null,null,null,null,null,null,null,null,null,null,null,null,null,"FUNDACION"]
[null,null,null,null,null,null,null,null,null,null,null,null,null,null,null,null,null,null,null,null,null,null,null,null,null,null,null,null,null,null,null,null,null,null,null,null,null,null,null,null,null,null,null,null,null,null,null,null,null,null,null,null,null,null,null,null,null,null,null,null,null,null,null,null,null,null,null,null,null,null,"GUAMAL"]
[null,null,null,null,null,null,null,null,null,null,null,null,null,null,null,null,null,null,null,null,null,null,null,null,null,null,null,null,null,null,null,null,null,null,null,null,null,null,null,null,null,null,null,null,null,null,null,null,null,null,null,null,null,null,null,null,null,null,null,null,null,null,null,null,null,null,null,null,null,null,"NUEVA GRANADA"]
[null,null,null,null,null,null,null,null,null,null,null,null,null,null,null,null,null,null,null,null,null,null,null,null,null,null,null,null,null,null,null,null,null,null,null,null,null,null,null,null,null,null,null,null,null,null,null,null,null,null,null,null,null,null,null,null,null,null,null,null,null,null,null,null,null,null,null,null,null,null,"PEDRAZA"]
[null,null,null,null,null,null,null,null,null,null,null,null,null,null,null,null,null,null,null,null,null,null,null,null,null,null,null,null,null,null,null,null,null,null,null,null,null,null,null,null,null,null,null,null,null,null,null,null,null,null,null,null,null,null,null,null,null,null,null,null,null,null,null,null,null,null,null,null,null,null,"PIJIÑO DEL CARMEN"]
[null,null,null,null,null,null,null,null,null,null,null,null,null,null,null,null,null,null,null,null,null,null,null,null,null,null,null,null,null,null,null,null,null,null,null,null,null,null,null,null,null,null,null,null,null,null,null,null,null,null,null,null,null,null,null,null,null,null,null,null,null,null,null,null,null,null,null,null,null,null,"PIVIJAY"]
[null,null,null,null,null,null,null,null,null,null,null,null,null,null,null,null,null,null,null,null,null,null,null,null,null,null,null,null,null,null,null,null,null,null,null,null,null,null,null,null,null,null,null,null,null,null,null,null,null,null,null,null,null,null,null,null,null,null,null,null,null,null,null,null,null,null,null,null,null,null,"PLATO"]
[null,null,null,null,null,null,null,null,null,null,null,null,null,null,null,null,null,null,null,null,null,null,null,null,null,null,null,null,null,null,null,null,null,null,null,null,null,null,null,null,null,null,null,null,null,null,null,null,null,null,null,null,null,null,null,null,null,null,null,null,null,null,null,null,null,null,null,null,null,null,"PUEBLOVIEJO"]
[null,null,null,null,null,null,null,null,null,null,null,null,null,null,null,null,null,null,null,null,null,null,null,null,null,null,null,null,null,null,null,null,null,null,null,null,null,null,null,null,null,null,null,null,null,null,null,null,null,null,null,null,null,null,null,null,null,null,null,null,null,null,null,null,null,null,null,null,null,null,"REMOLINO"]
[null,null,null,null,null,null,null,null,null,null,null,null,null,null,null,null,null,null,null,null,null,null,null,null,null,null,null,null,null,null,null,null,null,null,null,null,null,null,null,null,null,null,null,null,null,null,null,null,null,null,null,null,null,null,null,null,null,null,null,null,null,null,null,null,null,null,null,null,null,null,"SABANAS DE SAN ANGEL"]
[null,null,null,null,null,null,null,null,null,null,null,null,null,null,null,null,null,null,null,null,null,null,null,null,null,null,null,null,null,null,null,null,null,null,null,null,null,null,null,null,null,null,null,null,null,null,null,null,null,null,null,null,null,null,null,null,null,null,null,null,null,null,null,null,null,null,null,null,null,null,"SALAMINA"]
[null,null,null,null,null,null,null,null,null,null,null,null,null,null,null,null,null,null,null,null,null,null,null,null,null,null,null,null,null,null,null,null,null,null,null,null,null,null,null,null,null,null,null,null,null,null,null,null,null,null,null,null,null,null,null,null,null,null,null,null,null,null,null,null,null,null,null,null,null,null,"SAN SEBASTIAN DE BUENAVISTA"]
[null,null,null,null,null,null,null,null,null,null,null,null,null,null,null,null,null,null,null,null,null,null,null,null,null,null,null,null,null,null,null,null,null,null,null,null,null,null,null,null,null,null,null,null,null,null,null,null,null,null,null,null,null,null,null,null,null,null,null,null,null,null,null,null,null,null,null,null,null,null,"SAN ZENON"]
[null,null,null,null,null,null,null,null,null,null,null,null,null,null,null,null,null,null,null,null,null,null,null,null,null,null,null,null,null,null,null,null,null,null,null,null,null,null,null,null,null,null,null,null,null,null,null,null,null,null,null,null,null,null,null,null,null,null,null,null,null,null,null,null,null,null,null,null,null,null,"SANTA ANA"]
[null,null,null,null,null,null,null,null,null,null,null,null,null,null,null,null,null,null,null,null,null,null,null,null,null,null,null,null,null,null,null,null,null,null,null,null,null,null,null,null,null,null,null,null,null,null,null,null,null,null,null,null,null,null,null,null,null,null,null,null,null,null,null,null,null,null,null,null,null,null,"SANTA BARBARA DE PINTO"]
[null,null,null,null,null,null,null,null,null,null,null,null,null,null,null,null,null,null,null,null,null,null,null,null,null,null,null,null,null,null,null,null,null,null,null,null,null,null,null,null,null,null,null,null,null,null,null,null,null,null,null,null,null,null,null,null,null,null,null,null,null,null,null,null,null,null,null,null,null,null,"SANTA MARTA"]
[null,null,null,null,null,null,null,null,null,null,null,null,null,null,null,null,null,null,null,null,null,null,null,null,null,null,null,null,null,null,null,null,null,null,null,null,null,null,null,null,null,null,null,null,null,null,null,null,null,null,null,null,null,null,null,null,null,null,null,null,null,null,null,null,null,null,null,null,null,null,"SITIONUEVO"]
[null,null,null,null,null,null,null,null,null,null,null,null,null,null,null,null,null,null,null,null,null,null,null,null,null,null,null,null,null,null,null,null,null,null,null,null,null,null,null,null,null,null,null,null,null,null,null,null,null,null,null,null,null,null,null,null,null,null,null,null,null,null,null,null,null,null,null,null,null,null,"TENERIFE"]
[null,null,null,null,null,null,null,null,null,null,null,null,null,null,null,null,null,null,null,null,null,null,null,null,null,null,null,null,null,null,null,null,null,null,null,null,null,null,null,null,null,null,null,null,null,null,null,null,null,null,null,null,null,null,null,null,null,null,null,null,null,null,null,null,null,null,null,null,null,null,"ZAPAYAN"]
[null,null,null,null,null,null,null,null,null,null,null,null,null,null,null,null,null,null,null,null,null,null,null,null,null,null,null,null,null,null,null,null,null,null,null,null,null,null,null,null,null,null,null,null,null,null,null,null,null,null,null,null,null,null,null,null,null,null,null,null,null,null,null,null,null,null,null,null,null,null,"ZONA BANANERA"]
[null,null,null,null,null,null,null,null,null,null,null,null,null,null,null,null,null,null,null,null,null,null,null,null,null,null,null,null,null,null,null,null,null,null,null,null,null,null,null,null,null,null,null,null,null,null,null,null,null,null,null,null,null,null,null,null,null,null,null,null,null,null,null,null,null,null,null,null,null,null,"ACACIAS"]
[null,null,null,null,null,null,null,null,null,null,null,null,null,null,null,null,null,null,null,null,null,null,null,null,null,null,null,null,null,null,null,null,null,null,null,null,null,null,null,null,null,null,null,null,null,null,null,null,null,null,null,null,null,null,null,null,null,null,null,null,null,null,null,null,null,null,null,null,null,null,"BARRANCA DE UPIA"]
[null,null,null,null,null,null,null,null,null,null,null,null,null,null,null,null,null,null,null,null,null,null,null,null,null,null,null,null,null,null,null,null,null,null,null,null,null,null,null,null,null,null,null,null,null,null,null,null,null,null,null,null,null,null,null,null,null,null,null,null,null,null,null,null,null,null,null,null,null,null,"CABUYARO"]
[null,null,null,null,null,null,null,null,null,null,null,null,null,null,null,null,null,null,null,null,null,null,null,null,null,null,null,null,null,null,null,null,null,null,null,null,null,null,null,null,null,null,null,null,null,null,null,null,null,null,null,null,null,null,null,null,null,null,null,null,null,null,null,null,null,null,null,null,null,null,"CASTILLA LA NUEVA"]
[null,null,null,null,null,null,null,null,null,null,null,null,null,null,null,null,null,null,null,null,null,null,null,null,null,null,null,null,null,null,null,null,null,null,null,null,null,null,null,null,null,null,null,null,null,null,null,null,null,null,null,null,null,null,null,null,null,null,null,null,null,null,null,null,null,null,null,null,null,null,"CUBARRAL"]
[null,null,null,null,null,null,null,null,null,null,null,null,null,null,null,null,null,null,null,null,null,null,null,null,null,null,null,null,null,null,null,null,null,null,null,null,null,null,null,null,null,null,null,null,null,null,null,null,null,null,null,null,null,null,null,null,null,null,null,null,null,null,null,null,null,null,null,null,null,null,"CUMARAL"]
[null,null,null,null,null,null,null,null,null,null,null,null,null,null,null,null,null,null,null,null,null,null,null,null,null,null,null,null,null,null,null,null,null,null,null,null,null,null,null,null,null,null,null,null,null,null,null,null,null,null,null,null,null,null,null,null,null,null,null,null,null,null,null,null,null,null,null,null,null,null,"EL CALVARIO"]
[null,null,null,null,null,null,null,null,null,null,null,null,null,null,null,null,null,null,null,null,null,null,null,null,null,null,null,null,null,null,null,null,null,null,null,null,null,null,null,null,null,null,null,null,null,null,null,null,null,null,null,null,null,null,null,null,null,null,null,null,null,null,null,null,null,null,null,null,null,null,"EL CASTILLO"]
[null,null,null,null,null,null,null,null,null,null,null,null,null,null,null,null,null,null,null,null,null,null,null,null,null,null,null,null,null,null,null,null,null,null,null,null,null,null,null,null,null,null,null,null,null,null,null,null,null,null,null,null,null,null,null,null,null,null,null,null,null,null,null,null,null,null,null,null,null,null,"EL DORADO"]
[null,null,null,null,null,null,null,null,null,null,null,null,null,null,null,null,null,null,null,null,null,null,null,null,null,null,null,null,null,null,null,null,null,null,null,null,null,null,null,null,null,null,null,null,null,null,null,null,null,null,null,null,null,null,null,null,null,null,null,null,null,null,null,null,null,null,null,null,null,null,"FUENTE DE ORO"]
[null,null,null,null,null,null,null,null,null,null,null,null,null,null,null,null,null,null,null,null,null,null,null,null,null,null,null,null,null,null,null,null,null,null,null,null,null,null,null,null,null,null,null,null,null,null,null,null,null,null,null,null,null,null,null,null,null,null,null,null,null,null,null,null,null,null,null,null,null,null,"GRANADA"]
[null,null,null,null,null,null,null,null,null,null,null,null,null,null,null,null,null,null,null,null,null,null,null,null,null,null,null,null,null,null,null,null,null,null,null,null,null,null,null,null,null,null,null,null,null,null,null,null,null,null,null,null,null,null,null,null,null,null,null,null,null,null,null,null,null,null,null,null,null,null,"GUAMAL"]
[null,null,null,null,null,null,null,null,null,null,null,null,null,null,null,null,null,null,null,null,null,null,null,null,null,null,null,null,null,null,null,null,null,null,null,null,null,null,null,null,null,null,null,null,null,null,null,null,null,null,null,null,null,null,null,null,null,null,null,null,null,null,null,null,null,null,null,null,null,null,"LA MACARENA"]
[null,null,null,null,null,null,null,null,null,null,null,null,null,null,null,null,null,null,null,null,null,null,null,null,null,null,null,null,null,null,null,null,null,null,null,null,null,null,null,null,null,null,null,null,null,null,null,null,null,null,null,null,null,null,null,null,null,null,null,null,null,null,null,null,null,null,null,null,null,null,"LEJANIAS"]
[null,null,null,null,null,null,null,null,null,null,null,null,null,null,null,null,null,null,null,null,null,null,null,null,null,null,null,null,null,null,null,null,null,null,null,null,null,null,null,null,null,null,null,null,null,null,null,null,null,null,null,null,null,null,null,null,null,null,null,null,null,null,null,null,null,null,null,null,null,null,"MAPIRIPAN"]
[null,null,null,null,null,null,null,null,null,null,null,null,null,null,null,null,null,null,null,null,null,null,null,null,null,null,null,null,null,null,null,null,null,null,null,null,null,null,null,null,null,null,null,null,null,null,null,null,null,null,null,null,null,null,null,null,null,null,null,null,null,null,null,null,null,null,null,null,null,null,"MESETAS"]
[null,null,null,null,null,null,null,null,null,null,null,null,null,null,null,null,null,null,null,null,null,null,null,null,null,null,null,null,null,null,null,null,null,null,null,null,null,null,null,null,null,null,null,null,null,null,null,null,null,null,null,null,null,null,null,null,null,null,null,null,null,null,null,null,null,null,null,null,null,null,"PUERTO CONCORDIA"]
[null,null,null,null,null,null,null,null,null,null,null,null,null,null,null,null,null,null,null,null,null,null,null,null,null,null,null,null,null,null,null,null,null,null,null,null,null,null,null,null,null,null,null,null,null,null,null,null,null,null,null,null,null,null,null,null,null,null,null,null,null,null,null,null,null,null,null,null,null,null,"PUERTO GAITAN"]
[null,null,null,null,null,null,null,null,null,null,null,null,null,null,null,null,null,null,null,null,null,null,null,null,null,null,null,null,null,null,null,null,null,null,null,null,null,null,null,null,null,null,null,null,null,null,null,null,null,null,null,null,null,null,null,null,null,null,null,null,null,null,null,null,null,null,null,null,null,null,"PUERTO LLERAS"]
[null,null,null,null,null,null,null,null,null,null,null,null,null,null,null,null,null,null,null,null,null,null,null,null,null,null,null,null,null,null,null,null,null,null,null,null,null,null,null,null,null,null,null,null,null,null,null,null,null,null,null,null,null,null,null,null,null,null,null,null,null,null,null,null,null,null,null,null,null,null,"PUERTO LOPEZ"]
[null,null,null,null,null,null,null,null,null,null,null,null,null,null,null,null,null,null,null,null,null,null,null,null,null,null,null,null,null,null,null,null,null,null,null,null,null,null,null,null,null,null,null,null,null,null,null,null,null,null,null,null,null,null,null,null,null,null,null,null,null,null,null,null,null,null,null,null,null,null,"PUERTO RICO"]
[null,null,null,null,null,null,null,null,null,null,null,null,null,null,null,null,null,null,null,null,null,null,null,null,null,null,null,null,null,null,null,null,null,null,null,null,null,null,null,null,null,null,null,null,null,null,null,null,null,null,null,null,null,null,null,null,null,null,null,null,null,null,null,null,null,null,null,null,null,null,"RESTREPO"]
[null,null,null,null,null,null,null,null,null,null,null,null,null,null,null,null,null,null,null,null,null,null,null,null,null,null,null,null,null,null,null,null,null,null,null,null,null,null,null,null,null,null,null,null,null,null,null,null,null,null,null,null,null,null,null,null,null,null,null,null,null,null,null,null,null,null,null,null,null,null,"SAN CARLOS DE GUAROA"]
[null,null,null,null,null,null,null,null,null,null,null,null,null,null,null,null,null,null,null,null,null,null,null,null,null,null,null,null,null,null,null,null,null,null,null,null,null,null,null,null,null,null,null,null,null,null,null,null,null,null,null,null,null,null,null,null,null,null,null,null,null,null,null,null,null,null,null,null,null,null,"SAN JUAN DE ARAMA"]
[null,null,null,null,null,null,null,null,null,null,null,null,null,null,null,null,null,null,null,null,null,null,null,null,null,null,null,null,null,null,null,null,null,null,null,null,null,null,null,null,null,null,null,null,null,null,null,null,null,null,null,null,null,null,null,null,null,null,null,null,null,null,null,null,null,null,null,null,null,null,"SAN JUANITO"]
[null,null,null,null,null,null,null,null,null,null,null,null,null,null,null,null,null,null,null,null,null,null,null,null,null,null,null,null,null,null,null,null,null,null,null,null,null,null,null,null,null,null,null,null,null,null,null,null,null,null,null,null,null,null,null,null,null,null,null,null,null,null,null,null,null,null,null,null,null,null,"SAN MARTIN"]
[null,null,null,null,null,null,null,null,null,null,null,null,null,null,null,null,null,null,null,null,null,null,null,null,null,null,null,null,null,null,null,null,null,null,null,null,null,null,null,null,null,null,null,null,null,null,null,null,null,null,null,null,null,null,null,null,null,null,null,null,null,null,null,null,null,null,null,null,null,null,"URIBE"]
[null,null,null,null,null,null,null,null,null,null,null,null,null,null,null,null,null,null,null,null,null,null,null,null,null,null,null,null,null,null,null,null,null,null,null,null,null,null,null,null,null,null,null,null,null,null,null,null,null,null,null,null,null,null,null,null,null,null,null,null,null,null,null,null,null,null,null,null,null,null,"VILLAVICENCIO"]
[null,null,null,null,null,null,null,null,null,null,null,null,null,null,null,null,null,null,null,null,null,null,null,null,null,null,null,null,null,null,null,null,null,null,null,null,null,null,null,null,null,null,null,null,null,null,null,null,null,null,null,null,null,null,null,null,null,null,null,null,null,null,null,null,null,null,null,null,null,null,"VISTAHERMOSA"]
[null,null,null,null,null,null,null,null,null,null,null,null,null,null,null,null,null,null,null,null,null,null,null,null,null,null,null,null,null,null,null,null,null,null,null,null,null,null,null,null,null,null,null,null,null,null,null,null,null,null,null,null,null,null,null,null,null,null,null,null,null,null,null,null,null,null,null,null,null,null,"ABREGO"]
[null,null,null,null,null,null,null,null,null,null,null,null,null,null,null,null,null,null,null,null,null,null,null,null,null,null,null,null,null,null,null,null,null,null,null,null,null,null,null,null,null,null,null,null,null,null,null,null,null,null,null,null,null,null,null,null,null,null,null,null,null,null,null,null,null,null,null,null,null,null,"ARBOLEDAS"]
[null,null,null,null,null,null,null,null,null,null,null,null,null,null,null,null,null,null,null,null,null,null,null,null,null,null,null,null,null,null,null,null,null,null,null,null,null,null,null,null,null,null,null,null,null,null,null,null,null,null,null,null,null,null,null,null,null,null,null,null,null,null,null,null,null,null,null,null,null,null,"BOCHALEMA"]
[null,null,null,null,null,null,null,null,null,null,null,null,null,null,null,null,null,null,null,null,null,null,null,null,null,null,null,null,null,null,null,null,null,null,null,null,null,null,null,null,null,null,null,null,null,null,null,null,null,null,null,null,null,null,null,null,null,null,null,null,null,null,null,null,null,null,null,null,null,null,"BUCARASICA"]
[null,null,null,null,null,null,null,null,null,null,null,null,null,null,null,null,null,null,null,null,null,null,null,null,null,null,null,null,null,null,null,null,null,null,null,null,null,null,null,null,null,null,null,null,null,null,null,null,null,null,null,null,null,null,null,null,null,null,null,null,null,null,null,null,null,null,null,null,null,null,"CACHIRA"]
[null,null,null,null,null,null,null,null,null,null,null,null,null,null,null,null,null,null,null,null,null,null,null,null,null,null,null,null,null,null,null,null,null,null,null,null,null,null,null,null,null,null,null,null,null,null,null,null,null,null,null,null,null,null,null,null,null,null,null,null,null,null,null,null,null,null,null,null,null,null,"CACOTA"]
[null,null,null,null,null,null,null,null,null,null,null,null,null,null,null,null,null,null,null,null,null,null,null,null,null,null,null,null,null,null,null,null,null,null,null,null,null,null,null,null,null,null,null,null,null,null,null,null,null,null,null,null,null,null,null,null,null,null,null,null,null,null,null,null,null,null,null,null,null,null,"CHINACOTA"]
[null,null,null,null,null,null,null,null,null,null,null,null,null,null,null,null,null,null,null,null,null,null,null,null,null,null,null,null,null,null,null,null,null,null,null,null,null,null,null,null,null,null,null,null,null,null,null,null,null,null,null,null,null,null,null,null,null,null,null,null,null,null,null,null,null,null,null,null,null,null,"CHITAGA"]
[null,null,null,null,null,null,null,null,null,null,null,null,null,null,null,null,null,null,null,null,null,null,null,null,null,null,null,null,null,null,null,null,null,null,null,null,null,null,null,null,null,null,null,null,null,null,null,null,null,null,null,null,null,null,null,null,null,null,null,null,null,null,null,null,null,null,null,null,null,null,"CONVENCION"]
[null,null,null,null,null,null,null,null,null,null,null,null,null,null,null,null,null,null,null,null,null,null,null,null,null,null,null,null,null,null,null,null,null,null,null,null,null,null,null,null,null,null,null,null,null,null,null,null,null,null,null,null,null,null,null,null,null,null,null,null,null,null,null,null,null,null,null,null,null,null,"CUCUTA"]
[null,null,null,null,null,null,null,null,null,null,null,null,null,null,null,null,null,null,null,null,null,null,null,null,null,null,null,null,null,null,null,null,null,null,null,null,null,null,null,null,null,null,null,null,null,null,null,null,null,null,null,null,null,null,null,null,null,null,null,null,null,null,null,null,null,null,null,null,null,null,"CUCUTILLA"]
[null,null,null,null,null,null,null,null,null,null,null,null,null,null,null,null,null,null,null,null,null,null,null,null,null,null,null,null,null,null,null,null,null,null,null,null,null,null,null,null,null,null,null,null,null,null,null,null,null,null,null,null,null,null,null,null,null,null,null,null,null,null,null,null,null,null,null,null,null,null,"DURANIA"]
[null,null,null,null,null,null,null,null,null,null,null,null,null,null,null,null,null,null,null,null,null,null,null,null,null,null,null,null,null,null,null,null,null,null,null,null,null,null,null,null,null,null,null,null,null,null,null,null,null,null,null,null,null,null,null,null,null,null,null,null,null,null,null,null,null,null,null,null,null,null,"EL CARMEN"]
[null,null,null,null,null,null,null,null,null,null,null,null,null,null,null,null,null,null,null,null,null,null,null,null,null,null,null,null,null,null,null,null,null,null,null,null,null,null,null,null,null,null,null,null,null,null,null,null,null,null,null,null,null,null,null,null,null,null,null,null,null,null,null,null,null,null,null,null,null,null,"EL TARRA"]
[null,null,null,null,null,null,null,null,null,null,null,null,null,null,null,null,null,null,null,null,null,null,null,null,null,null,null,null,null,null,null,null,null,null,null,null,null,null,null,null,null,null,null,null,null,null,null,null,null,null,null,null,null,null,null,null,null,null,null,null,null,null,null,null,null,null,null,null,null,null,"EL ZULIA"]
[null,null,null,null,null,null,null,null,null,null,null,null,null,null,null,null,null,null,null,null,null,null,null,null,null,null,null,null,null,null,null,null,null,null,null,null,null,null,null,null,null,null,null,null,null,null,null,null,null,null,null,null,null,null,null,null,null,null,null,null,null,null,null,null,null,null,null,null,null,null,"GRAMALOTE"]
[null,null,null,null,null,null,null,null,null,null,null,null,null,null,null,null,null,null,null,null,null,null,null,null,null,null,null,null,null,null,null,null,null,null,null,null,null,null,null,null,null,null,null,null,null,null,null,null,null,null,null,null,null,null,null,null,null,null,null,null,null,null,null,null,null,null,null,null,null,null,"HACARI"]
[null,null,null,null,null,null,null,null,null,null,null,null,null,null,null,null,null,null,null,null,null,null,null,null,null,null,null,null,null,null,null,null,null,null,null,null,null,null,null,null,null,null,null,null,null,null,null,null,null,null,null,null,null,null,null,null,null,null,null,null,null,null,null,null,null,null,null,null,null,null,"HERRAN"]
[null,null,null,null,null,null,null,null,null,null,null,null,null,null,null,null,null,null,null,null,null,null,null,null,null,null,null,null,null,null,null,null,null,null,null,null,null,null,null,null,null,null,null,null,null,null,null,null,null,null,null,null,null,null,null,null,null,null,null,null,null,null,null,null,null,null,null,null,null,null,"LA ESPERANZA"]
[null,null,null,null,null,null,null,null,null,null,null,null,null,null,null,null,null,null,null,null,null,null,null,null,null,null,null,null,null,null,null,null,null,null,null,null,null,null,null,null,null,null,null,null,null,null,null,null,null,null,null,null,null,null,null,null,null,null,null,null,null,null,null,null,null,null,null,null,null,null,"LA PLAYA"]
[null,null,null,null,null,null,null,null,null,null,null,null,null,null,null,null,null,null,null,null,null,null,null,null,null,null,null,null,null,null,null,null,null,null,null,null,null,null,null,null,null,null,null,null,null,null,null,null,null,null,null,null,null,null,null,null,null,null,null,null,null,null,null,null,null,null,null,null,null,null,"LABATECA"]
[null,null,null,null,null,null,null,null,null,null,null,null,null,null,null,null,null,null,null,null,null,null,null,null,null,null,null,null,null,null,null,null,null,null,null,null,null,null,null,null,null,null,null,null,null,null,null,null,null,null,null,null,null,null,null,null,null,null,null,null,null,null,null,null,null,null,null,null,null,null,"LOS PATIOS"]
[null,null,null,null,null,null,null,null,null,null,null,null,null,null,null,null,null,null,null,null,null,null,null,null,null,null,null,null,null,null,null,null,null,null,null,null,null,null,null,null,null,null,null,null,null,null,null,null,null,null,null,null,null,null,null,null,null,null,null,null,null,null,null,null,null,null,null,null,null,null,"LOURDES"]
[null,null,null,null,null,null,null,null,null,null,null,null,null,null,null,null,null,null,null,null,null,null,null,null,null,null,null,null,null,null,null,null,null,null,null,null,null,null,null,null,null,null,null,null,null,null,null,null,null,null,null,null,null,null,null,null,null,null,null,null,null,null,null,null,null,null,null,null,null,null,"MUTISCUA"]
[null,null,null,null,null,null,null,null,null,null,null,null,null,null,null,null,null,null,null,null,null,null,null,null,null,null,null,null,null,null,null,null,null,null,null,null,null,null,null,null,null,null,null,null,null,null,null,null,null,null,null,null,null,null,null,null,null,null,null,null,null,null,null,null,null,null,null,null,null,null,"OCAÑA"]
[null,null,null,null,null,null,null,null,null,null,null,null,null,null,null,null,null,null,null,null,null,null,null,null,null,null,null,null,null,null,null,null,null,null,null,null,null,null,null,null,null,null,null,null,null,null,null,null,null,null,null,null,null,null,null,null,null,null,null,null,null,null,null,null,null,null,null,null,null,null,"PAMPLONA"]
[null,null,null,null,null,null,null,null,null,null,null,null,null,null,null,null,null,null,null,null,null,null,null,null,null,null,null,null,null,null,null,null,null,null,null,null,null,null,null,null,null,null,null,null,null,null,null,null,null,null,null,null,null,null,null,null,null,null,null,null,null,null,null,null,null,null,null,null,null,null,"PAMPLONITA"]
[null,null,null,null,null,null,null,null,null,null,null,null,null,null,null,null,null,null,null,null,null,null,null,null,null,null,null,null,null,null,null,null,null,null,null,null,null,null,null,null,null,null,null,null,null,null,null,null,null,null,null,null,null,null,null,null,null,null,null,null,null,null,null,null,null,null,null,null,null,null,"PUERTO SANTANDER"]
[null,null,null,null,null,null,null,null,null,null,null,null,null,null,null,null,null,null,null,null,null,null,null,null,null,null,null,null,null,null,null,null,null,null,null,null,null,null,null,null,null,null,null,null,null,null,null,null,null,null,null,null,null,null,null,null,null,null,null,null,null,null,null,null,null,null,null,null,null,null,"RAGONVALIA"]
[null,null,null,null,null,null,null,null,null,null,null,null,null,null,null,null,null,null,null,null,null,null,null,null,null,null,null,null,null,null,null,null,null,null,null,null,null,null,null,null,null,null,null,null,null,null,null,null,null,null,null,null,null,null,null,null,null,null,null,null,null,null,null,null,null,null,null,null,null,null,"SALAZAR"]
[null,null,null,null,null,null,null,null,null,null,null,null,null,null,null,null,null,null,null,null,null,null,null,null,null,null,null,null,null,null,null,null,null,null,null,null,null,null,null,null,null,null,null,null,null,null,null,null,null,null,null,null,null,null,null,null,null,null,null,null,null,null,null,null,null,null,null,null,null,null,"SAN CALIXTO"]
[null,null,null,null,null,null,null,null,null,null,null,null,null,null,null,null,null,null,null,null,null,null,null,null,null,null,null,null,null,null,null,null,null,null,null,null,null,null,null,null,null,null,null,null,null,null,null,null,null,null,null,null,null,null,null,null,null,null,null,null,null,null,null,null,null,null,null,null,null,null,"SAN CAYETANO"]
[null,null,null,null,null,null,null,null,null,null,null,null,null,null,null,null,null,null,null,null,null,null,null,null,null,null,null,null,null,null,null,null,null,null,null,null,null,null,null,null,null,null,null,null,null,null,null,null,null,null,null,null,null,null,null,null,null,null,null,null,null,null,null,null,null,null,null,null,null,null,"SANTIAGO"]
[null,null,null,null,null,null,null,null,null,null,null,null,null,null,null,null,null,null,null,null,null,null,null,null,null,null,null,null,null,null,null,null,null,null,null,null,null,null,null,null,null,null,null,null,null,null,null,null,null,null,null,null,null,null,null,null,null,null,null,null,null,null,null,null,null,null,null,null,null,null,"SARDINATA"]
[null,null,null,null,null,null,null,null,null,null,null,null,null,null,null,null,null,null,null,null,null,null,null,null,null,null,null,null,null,null,null,null,null,null,null,null,null,null,null,null,null,null,null,null,null,null,null,null,null,null,null,null,null,null,null,null,null,null,null,null,null,null,null,null,null,null,null,null,null,null,"SILOS"]
[null,null,null,null,null,null,null,null,null,null,null,null,null,null,null,null,null,null,null,null,null,null,null,null,null,null,null,null,null,null,null,null,null,null,null,null,null,null,null,null,null,null,null,null,null,null,null,null,null,null,null,null,null,null,null,null,null,null,null,null,null,null,null,null,null,null,null,null,null,null,"TEORAMA"]
[null,null,null,null,null,null,null,null,null,null,null,null,null,null,null,null,null,null,null,null,null,null,null,null,null,null,null,null,null,null,null,null,null,null,null,null,null,null,null,null,null,null,null,null,null,null,null,null,null,null,null,null,null,null,null,null,null,null,null,null,null,null,null,null,null,null,null,null,null,null,"TIBU"]
[null,null,null,null,null,null,null,null,null,null,null,null,null,null,null,null,null,null,null,null,null,null,null,null,null,null,null,null,null,null,null,null,null,null,null,null,null,null,null,null,null,null,null,null,null,null,null,null,null,null,null,null,null,null,null,null,null,null,null,null,null,null,null,null,null,null,null,null,null,null,"TOLEDO"]
[null,null,null,null,null,null,null,null,null,null,null,null,null,null,null,null,null,null,null,null,null,null,null,null,null,null,null,null,null,null,null,null,null,null,null,null,null,null,null,null,null,null,null,null,null,null,null,null,null,null,null,null,null,null,null,null,null,null,null,null,null,null,null,null,null,null,null,null,null,null,"VILLA CARO"]
[null,null,null,null,null,null,null,null,null,null,null,null,null,null,null,null,null,null,null,null,null,null,null,null,null,null,null,null,null,null,null,null,null,null,null,null,null,null,null,null,null,null,null,null,null,null,null,null,null,null,null,null,null,null,null,null,null,null,null,null,null,null,null,null,null,null,null,null,null,null,"VILLA DEL ROSARIO"]
[null,null,null,null,null,null,null,null,null,null,null,null,null,null,null,null,null,null,null,null,null,null,null,null,null,null,null,null,null,null,null,null,null,null,null,null,null,null,null,null,null,null,null,null,null,null,null,null,null,null,null,null,null,null,null,null,null,null,null,null,null,null,null,null,null,null,null,null,null,null,"ALBAN"]
[null,null,null,null,null,null,null,null,null,null,null,null,null,null,null,null,null,null,null,null,null,null,null,null,null,null,null,null,null,null,null,null,null,null,null,null,null,null,null,null,null,null,null,null,null,null,null,null,null,null,null,null,null,null,null,null,null,null,null,null,null,null,null,null,null,null,null,null,null,null,"ALDANA"]
[null,null,null,null,null,null,null,null,null,null,null,null,null,null,null,null,null,null,null,null,null,null,null,null,null,null,null,null,null,null,null,null,null,null,null,null,null,null,null,null,null,null,null,null,null,null,null,null,null,null,null,null,null,null,null,null,null,null,null,null,null,null,null,null,null,null,null,null,null,null,"ANCUYA"]
[null,null,null,null,null,null,null,null,null,null,null,null,null,null,null,null,null,null,null,null,null,null,null,null,null,null,null,null,null,null,null,null,null,null,null,null,null,null,null,null,null,null,null,null,null,null,null,null,null,null,null,null,null,null,null,null,null,null,null,null,null,null,null,null,null,null,null,null,null,null,"ARBOLEDA"]
[null,null,null,null,null,null,null,null,null,null,null,null,null,null,null,null,null,null,null,null,null,null,null,null,null,null,null,null,null,null,null,null,null,null,null,null,null,null,null,null,null,null,null,null,null,null,null,null,null,null,null,null,null,null,null,null,null,null,null,null,null,null,null,null,null,null,null,null,null,null,"BARBACOAS"]
[null,null,null,null,null,null,null,null,null,null,null,null,null,null,null,null,null,null,null,null,null,null,null,null,null,null,null,null,null,null,null,null,null,null,null,null,null,null,null,null,null,null,null,null,null,null,null,null,null,null,null,null,null,null,null,null,null,null,null,null,null,null,null,null,null,null,null,null,null,null,"BELEN"]
[null,null,null,null,null,null,null,null,null,null,null,null,null,null,null,null,null,null,null,null,null,null,null,null,null,null,null,null,null,null,null,null,null,null,null,null,null,null,null,null,null,null,null,null,null,null,null,null,null,null,null,null,null,null,null,null,null,null,null,null,null,null,null,null,null,null,null,null,null,null,"BUESACO"]
[null,null,null,null,null,null,null,null,null,null,null,null,null,null,null,null,null,null,null,null,null,null,null,null,null,null,null,null,null,null,null,null,null,null,null,null,null,null,null,null,null,null,null,null,null,null,null,null,null,null,null,null,null,null,null,null,null,null,null,null,null,null,null,null,null,null,null,null,null,null,"CHACHAGsI"]
[null,null,null,null,null,null,null,null,null,null,null,null,null,null,null,null,null,null,null,null,null,null,null,null,null,null,null,null,null,null,null,null,null,null,null,null,null,null,null,null,null,null,null,null,null,null,null,null,null,null,null,null,null,null,null,null,null,null,null,null,null,null,null,null,null,null,null,null,null,null,"COLON"]
[null,null,null,null,null,null,null,null,null,null,null,null,null,null,null,null,null,null,null,null,null,null,null,null,null,null,null,null,null,null,null,null,null,null,null,null,null,null,null,null,null,null,null,null,null,null,null,null,null,null,null,null,null,null,null,null,null,null,null,null,null,null,null,null,null,null,null,null,null,null,"CONSACA"]
[null,null,null,null,null,null,null,null,null,null,null,null,null,null,null,null,null,null,null,null,null,null,null,null,null,null,null,null,null,null,null,null,null,null,null,null,null,null,null,null,null,null,null,null,null,null,null,null,null,null,null,null,null,null,null,null,null,null,null,null,null,null,null,null,null,null,null,null,null,null,"CONTADERO"]
[null,null,null,null,null,null,null,null,null,null,null,null,null,null,null,null,null,null,null,null,null,null,null,null,null,null,null,null,null,null,null,null,null,null,null,null,null,null,null,null,null,null,null,null,null,null,null,null,null,null,null,null,null,null,null,null,null,null,null,null,null,null,null,null,null,null,null,null,null,null,"CORDOBA"]
[null,null,null,null,null,null,null,null,null,null,null,null,null,null,null,null,null,null,null,null,null,null,null,null,null,null,null,null,null,null,null,null,null,null,null,null,null,null,null,null,null,null,null,null,null,null,null,null,null,null,null,null,null,null,null,null,null,null,null,null,null,null,null,null,null,null,null,null,null,null,"CUASPUD"]
[null,null,null,null,null,null,null,null,null,null,null,null,null,null,null,null,null,null,null,null,null,null,null,null,null,null,null,null,null,null,null,null,null,null,null,null,null,null,null,null,null,null,null,null,null,null,null,null,null,null,null,null,null,null,null,null,null,null,null,null,null,null,null,null,null,null,null,null,null,null,"CUMBAL"]
[null,null,null,null,null,null,null,null,null,null,null,null,null,null,null,null,null,null,null,null,null,null,null,null,null,null,null,null,null,null,null,null,null,null,null,null,null,null,null,null,null,null,null,null,null,null,null,null,null,null,null,null,null,null,null,null,null,null,null,null,null,null,null,null,null,null,null,null,null,null,"CUMBITARA"]
[null,null,null,null,null,null,null,null,null,null,null,null,null,null,null,null,null,null,null,null,null,null,null,null,null,null,null,null,null,null,null,null,null,null,null,null,null,null,null,null,null,null,null,null,null,null,null,null,null,null,null,null,null,null,null,null,null,null,null,null,null,null,null,null,null,null,null,null,null,null,"EL CHARCO"]
[null,null,null,null,null,null,null,null,null,null,null,null,null,null,null,null,null,null,null,null,null,null,null,null,null,null,null,null,null,null,null,null,null,null,null,null,null,null,null,null,null,null,null,null,null,null,null,null,null,null,null,null,null,null,null,null,null,null,null,null,null,null,null,null,null,null,null,null,null,null,"EL PEÑOL"]
[null,null,null,null,null,null,null,null,null,null,null,null,null,null,null,null,null,null,null,null,null,null,null,null,null,null,null,null,null,null,null,null,null,null,null,null,null,null,null,null,null,null,null,null,null,null,null,null,null,null,null,null,null,null,null,null,null,null,null,null,null,null,null,null,null,null,null,null,null,null,"EL ROSARIO"]
[null,null,null,null,null,null,null,null,null,null,null,null,null,null,null,null,null,null,null,null,null,null,null,null,null,null,null,null,null,null,null,null,null,null,null,null,null,null,null,null,null,null,null,null,null,null,null,null,null,null,null,null,null,null,null,null,null,null,null,null,null,null,null,null,null,null,null,null,null,null,"EL TABLON DE GOMEZ"]
[null,null,null,null,null,null,null,null,null,null,null,null,null,null,null,null,null,null,null,null,null,null,null,null,null,null,null,null,null,null,null,null,null,null,null,null,null,null,null,null,null,null,null,null,null,null,null,null,null,null,null,null,null,null,null,null,null,null,null,null,null,null,null,null,null,null,null,null,null,null,"EL TAMBO"]
[null,null,null,null,null,null,null,null,null,null,null,null,null,null,null,null,null,null,null,null,null,null,null,null,null,null,null,null,null,null,null,null,null,null,null,null,null,null,null,null,null,null,null,null,null,null,null,null,null,null,null,null,null,null,null,null,null,null,null,null,null,null,null,null,null,null,null,null,null,null,"FRANCISCO PIZARRO"]
[null,null,null,null,null,null,null,null,null,null,null,null,null,null,null,null,null,null,null,null,null,null,null,null,null,null,null,null,null,null,null,null,null,null,null,null,null,null,null,null,null,null,null,null,null,null,null,null,null,null,null,null,null,null,null,null,null,null,null,null,null,null,null,null,null,null,null,null,null,null,"FUNES"]
[null,null,null,null,null,null,null,null,null,null,null,null,null,null,null,null,null,null,null,null,null,null,null,null,null,null,null,null,null,null,null,null,null,null,null,null,null,null,null,null,null,null,null,null,null,null,null,null,null,null,null,null,null,null,null,null,null,null,null,null,null,null,null,null,null,null,null,null,null,null,"GUACHUCAL"]
[null,null,null,null,null,null,null,null,null,null,null,null,null,null,null,null,null,null,null,null,null,null,null,null,null,null,null,null,null,null,null,null,null,null,null,null,null,null,null,null,null,null,null,null,null,null,null,null,null,null,null,null,null,null,null,null,null,null,null,null,null,null,null,null,null,null,null,null,null,null,"GUAITARILLA"]
[null,null,null,null,null,null,null,null,null,null,null,null,null,null,null,null,null,null,null,null,null,null,null,null,null,null,null,null,null,null,null,null,null,null,null,null,null,null,null,null,null,null,null,null,null,null,null,null,null,null,null,null,null,null,null,null,null,null,null,null,null,null,null,null,null,null,null,null,null,null,"GUALMATAN"]
[null,null,null,null,null,null,null,null,null,null,null,null,null,null,null,null,null,null,null,null,null,null,null,null,null,null,null,null,null,null,null,null,null,null,null,null,null,null,null,null,null,null,null,null,null,null,null,null,null,null,null,null,null,null,null,null,null,null,null,null,null,null,null,null,null,null,null,null,null,null,"ILES"]
[null,null,null,null,null,null,null,null,null,null,null,null,null,null,null,null,null,null,null,null,null,null,null,null,null,null,null,null,null,null,null,null,null,null,null,null,null,null,null,null,null,null,null,null,null,null,null,null,null,null,null,null,null,null,null,null,null,null,null,null,null,null,null,null,null,null,null,null,null,null,"IMUES"]
[null,null,null,null,null,null,null,null,null,null,null,null,null,null,null,null,null,null,null,null,null,null,null,null,null,null,null,null,null,null,null,null,null,null,null,null,null,null,null,null,null,null,null,null,null,null,null,null,null,null,null,null,null,null,null,null,null,null,null,null,null,null,null,null,null,null,null,null,null,null,"IPIALES"]
[null,null,null,null,null,null,null,null,null,null,null,null,null,null,null,null,null,null,null,null,null,null,null,null,null,null,null,null,null,null,null,null,null,null,null,null,null,null,null,null,null,null,null,null,null,null,null,null,null,null,null,null,null,null,null,null,null,null,null,null,null,null,null,null,null,null,null,null,null,null,"LA CRUZ"]
[null,null,null,null,null,null,null,null,null,null,null,null,null,null,null,null,null,null,null,null,null,null,null,null,null,null,null,null,null,null,null,null,null,null,null,null,null,null,null,null,null,null,null,null,null,null,null,null,null,null,null,null,null,null,null,null,null,null,null,null,null,null,null,null,null,null,null,null,null,null,"LA FLORIDA"]
[null,null,null,null,null,null,null,null,null,null,null,null,null,null,null,null,null,null,null,null,null,null,null,null,null,null,null,null,null,null,null,null,null,null,null,null,null,null,null,null,null,null,null,null,null,null,null,null,null,null,null,null,null,null,null,null,null,null,null,null,null,null,null,null,null,null,null,null,null,null,"LA LLANADA"]
[null,null,null,null,null,null,null,null,null,null,null,null,null,null,null,null,null,null,null,null,null,null,null,null,null,null,null,null,null,null,null,null,null,null,null,null,null,null,null,null,null,null,null,null,null,null,null,null,null,null,null,null,null,null,null,null,null,null,null,null,null,null,null,null,null,null,null,null,null,null,"LA TOLA"]
[null,null,null,null,null,null,null,null,null,null,null,null,null,null,null,null,null,null,null,null,null,null,null,null,null,null,null,null,null,null,null,null,null,null,null,null,null,null,null,null,null,null,null,null,null,null,null,null,null,null,null,null,null,null,null,null,null,null,null,null,null,null,null,null,null,null,null,null,null,null,"LA UNION"]
[null,null,null,null,null,null,null,null,null,null,null,null,null,null,null,null,null,null,null,null,null,null,null,null,null,null,null,null,null,null,null,null,null,null,null,null,null,null,null,null,null,null,null,null,null,null,null,null,null,null,null,null,null,null,null,null,null,null,null,null,null,null,null,null,null,null,null,null,null,null,"LEIVA"]
[null,null,null,null,null,null,null,null,null,null,null,null,null,null,null,null,null,null,null,null,null,null,null,null,null,null,null,null,null,null,null,null,null,null,null,null,null,null,null,null,null,null,null,null,null,null,null,null,null,null,null,null,null,null,null,null,null,null,null,null,null,null,null,null,null,null,null,null,null,null,"LINARES"]
[null,null,null,null,null,null,null,null,null,null,null,null,null,null,null,null,null,null,null,null,null,null,null,null,null,null,null,null,null,null,null,null,null,null,null,null,null,null,null,null,null,null,null,null,null,null,null,null,null,null,null,null,null,null,null,null,null,null,null,null,null,null,null,null,null,null,null,null,null,null,"LOS ANDES"]
[null,null,null,null,null,null,null,null,null,null,null,null,null,null,null,null,null,null,null,null,null,null,null,null,null,null,null,null,null,null,null,null,null,null,null,null,null,null,null,null,null,null,null,null,null,null,null,null,null,null,null,null,null,null,null,null,null,null,null,null,null,null,null,null,null,null,null,null,null,null,"MAGsI"]
[null,null,null,null,null,null,null,null,null,null,null,null,null,null,null,null,null,null,null,null,null,null,null,null,null,null,null,null,null,null,null,null,null,null,null,null,null,null,null,null,null,null,null,null,null,null,null,null,null,null,null,null,null,null,null,null,null,null,null,null,null,null,null,null,null,null,null,null,null,null,"MALLAMA"]
[null,null,null,null,null,null,null,null,null,null,null,null,null,null,null,null,null,null,null,null,null,null,null,null,null,null,null,null,null,null,null,null,null,null,null,null,null,null,null,null,null,null,null,null,null,null,null,null,null,null,null,null,null,null,null,null,null,null,null,null,null,null,null,null,null,null,null,null,null,null,"MOSQUERA"]
[null,null,null,null,null,null,null,null,null,null,null,null,null,null,null,null,null,null,null,null,null,null,null,null,null,null,null,null,null,null,null,null,null,null,null,null,null,null,null,null,null,null,null,null,null,null,null,null,null,null,null,null,null,null,null,null,null,null,null,null,null,null,null,null,null,null,null,null,null,null,"NARIÑO"]
[null,null,null,null,null,null,null,null,null,null,null,null,null,null,null,null,null,null,null,null,null,null,null,null,null,null,null,null,null,null,null,null,null,null,null,null,null,null,null,null,null,null,null,null,null,null,null,null,null,null,null,null,null,null,null,null,null,null,null,null,null,null,null,null,null,null,null,null,null,null,"OLAYA HERRERA"]
[null,null,null,null,null,null,null,null,null,null,null,null,null,null,null,null,null,null,null,null,null,null,null,null,null,null,null,null,null,null,null,null,null,null,null,null,null,null,null,null,null,null,null,null,null,null,null,null,null,null,null,null,null,null,null,null,null,null,null,null,null,null,null,null,null,null,null,null,null,null,"OSPINA"]
[null,null,null,null,null,null,null,null,null,null,null,null,null,null,null,null,null,null,null,null,null,null,null,null,null,null,null,null,null,null,null,null,null,null,null,null,null,null,null,null,null,null,null,null,null,null,null,null,null,null,null,null,null,null,null,null,null,null,null,null,null,null,null,null,null,null,null,null,null,null,"PASTO"]
[null,null,null,null,null,null,null,null,null,null,null,null,null,null,null,null,null,null,null,null,null,null,null,null,null,null,null,null,null,null,null,null,null,null,null,null,null,null,null,null,null,null,null,null,null,null,null,null,null,null,null,null,null,null,null,null,null,null,null,null,null,null,null,null,null,null,null,null,null,null,"POLICARPA"]
[null,null,null,null,null,null,null,null,null,null,null,null,null,null,null,null,null,null,null,null,null,null,null,null,null,null,null,null,null,null,null,null,null,null,null,null,null,null,null,null,null,null,null,null,null,null,null,null,null,null,null,null,null,null,null,null,null,null,null,null,null,null,null,null,null,null,null,null,null,null,"POTOSI"]
[null,null,null,null,null,null,null,null,null,null,null,null,null,null,null,null,null,null,null,null,null,null,null,null,null,null,null,null,null,null,null,null,null,null,null,null,null,null,null,null,null,null,null,null,null,null,null,null,null,null,null,null,null,null,null,null,null,null,null,null,null,null,null,null,null,null,null,null,null,null,"PROVIDENCIA"]
[null,null,null,null,null,null,null,null,null,null,null,null,null,null,null,null,null,null,null,null,null,null,null,null,null,null,null,null,null,null,null,null,null,null,null,null,null,null,null,null,null,null,null,null,null,null,null,null,null,null,null,null,null,null,null,null,null,null,null,null,null,null,null,null,null,null,null,null,null,null,"PUERRES"]
[null,null,null,null,null,null,null,null,null,null,null,null,null,null,null,null,null,null,null,null,null,null,null,null,null,null,null,null,null,null,null,null,null,null,null,null,null,null,null,null,null,null,null,null,null,null,null,null,null,null,null,null,null,null,null,null,null,null,null,null,null,null,null,null,null,null,null,null,null,null,"PUPIALES"]
[null,null,null,null,null,null,null,null,null,null,null,null,null,null,null,null,null,null,null,null,null,null,null,null,null,null,null,null,null,null,null,null,null,null,null,null,null,null,null,null,null,null,null,null,null,null,null,null,null,null,null,null,null,null,null,null,null,null,null,null,null,null,null,null,null,null,null,null,null,null,"RICAURTE"]
[null,null,null,null,null,null,null,null,null,null,null,null,null,null,null,null,null,null,null,null,null,null,null,null,null,null,null,null,null,null,null,null,null,null,null,null,null,null,null,null,null,null,null,null,null,null,null,null,null,null,null,null,null,null,null,null,null,null,null,null,null,null,null,null,null,null,null,null,null,null,"ROBERTO PAYAN"]
[null,null,null,null,null,null,null,null,null,null,null,null,null,null,null,null,null,null,null,null,null,null,null,null,null,null,null,null,null,null,null,null,null,null,null,null,null,null,null,null,null,null,null,null,null,null,null,null,null,null,null,null,null,null,null,null,null,null,null,null,null,null,null,null,null,null,null,null,null,null,"SAMANIEGO"]
[null,null,null,null,null,null,null,null,null,null,null,null,null,null,null,null,null,null,null,null,null,null,null,null,null,null,null,null,null,null,null,null,null,null,null,null,null,null,null,null,null,null,null,null,null,null,null,null,null,null,null,null,null,null,null,null,null,null,null,null,null,null,null,null,null,null,null,null,null,null,"SAN ANDRES DE TUMACO"]
[null,null,null,null,null,null,null,null,null,null,null,null,null,null,null,null,null,null,null,null,null,null,null,null,null,null,null,null,null,null,null,null,null,null,null,null,null,null,null,null,null,null,null,null,null,null,null,null,null,null,null,null,null,null,null,null,null,null,null,null,null,null,null,null,null,null,null,null,null,null,"SAN BERNARDO"]
[null,null,null,null,null,null,null,null,null,null,null,null,null,null,null,null,null,null,null,null,null,null,null,null,null,null,null,null,null,null,null,null,null,null,null,null,null,null,null,null,null,null,null,null,null,null,null,null,null,null,null,null,null,null,null,null,null,null,null,null,null,null,null,null,null,null,null,null,null,null,"SAN LORENZO"]
[null,null,null,null,null,null,null,null,null,null,null,null,null,null,null,null,null,null,null,null,null,null,null,null,null,null,null,null,null,null,null,null,null,null,null,null,null,null,null,null,null,null,null,null,null,null,null,null,null,null,null,null,null,null,null,null,null,null,null,null,null,null,null,null,null,null,null,null,null,null,"SAN PABLO"]
[null,null,null,null,null,null,null,null,null,null,null,null,null,null,null,null,null,null,null,null,null,null,null,null,null,null,null,null,null,null,null,null,null,null,null,null,null,null,null,null,null,null,null,null,null,null,null,null,null,null,null,null,null,null,null,null,null,null,null,null,null,null,null,null,null,null,null,null,null,null,"SAN PEDRO DE CARTAGO"]
[null,null,null,null,null,null,null,null,null,null,null,null,null,null,null,null,null,null,null,null,null,null,null,null,null,null,null,null,null,null,null,null,null,null,null,null,null,null,null,null,null,null,null,null,null,null,null,null,null,null,null,null,null,null,null,null,null,null,null,null,null,null,null,null,null,null,null,null,null,null,"SANDONA"]
[null,null,null,null,null,null,null,null,null,null,null,null,null,null,null,null,null,null,null,null,null,null,null,null,null,null,null,null,null,null,null,null,null,null,null,null,null,null,null,null,null,null,null,null,null,null,null,null,null,null,null,null,null,null,null,null,null,null,null,null,null,null,null,null,null,null,null,null,null,null,"SANTA BARBARA"]
[null,null,null,null,null,null,null,null,null,null,null,null,null,null,null,null,null,null,null,null,null,null,null,null,null,null,null,null,null,null,null,null,null,null,null,null,null,null,null,null,null,null,null,null,null,null,null,null,null,null,null,null,null,null,null,null,null,null,null,null,null,null,null,null,null,null,null,null,null,null,"SANTACRUZ"]
[null,null,null,null,null,null,null,null,null,null,null,null,null,null,null,null,null,null,null,null,null,null,null,null,null,null,null,null,null,null,null,null,null,null,null,null,null,null,null,null,null,null,null,null,null,null,null,null,null,null,null,null,null,null,null,null,null,null,null,null,null,null,null,null,null,null,null,null,null,null,"SAPUYES"]
[null,null,null,null,null,null,null,null,null,null,null,null,null,null,null,null,null,null,null,null,null,null,null,null,null,null,null,null,null,null,null,null,null,null,null,null,null,null,null,null,null,null,null,null,null,null,null,null,null,null,null,null,null,null,null,null,null,null,null,null,null,null,null,null,null,null,null,null,null,null,"TAMINANGO"]
[null,null,null,null,null,null,null,null,null,null,null,null,null,null,null,null,null,null,null,null,null,null,null,null,null,null,null,null,null,null,null,null,null,null,null,null,null,null,null,null,null,null,null,null,null,null,null,null,null,null,null,null,null,null,null,null,null,null,null,null,null,null,null,null,null,null,null,null,null,null,"TANGUA"]
[null,null,null,null,null,null,null,null,null,null,null,null,null,null,null,null,null,null,null,null,null,null,null,null,null,null,null,null,null,null,null,null,null,null,null,null,null,null,null,null,null,null,null,null,null,null,null,null,null,null,null,null,null,null,null,null,null,null,null,null,null,null,null,null,null,null,null,null,null,null,"TUQUERRES"]
[null,null,null,null,null,null,null,null,null,null,null,null,null,null,null,null,null,null,null,null,null,null,null,null,null,null,null,null,null,null,null,null,null,null,null,null,null,null,null,null,null,null,null,null,null,null,null,null,null,null,null,null,null,null,null,null,null,null,null,null,null,null,null,null,null,null,null,null,null,null,"YACUANQUER"]
[null,null,null,null,null,null,null,null,null,null,null,null,null,null,null,null,null,null,null,null,null,null,null,null,null,null,null,null,null,null,null,null,null,null,null,null,null,null,null,null,null,null,null,null,null,null,null,null,null,null,null,null,null,null,null,null,null,null,null,null,null,null,null,null,null,null,null,null,null,null,"COLON"]
[null,null,null,null,null,null,null,null,null,null,null,null,null,null,null,null,null,null,null,null,null,null,null,null,null,null,null,null,null,null,null,null,null,null,null,null,null,null,null,null,null,null,null,null,null,null,null,null,null,null,null,null,null,null,null,null,null,null,null,null,null,null,null,null,null,null,null,null,null,null,"LEGUIZAMO"]
[null,null,null,null,null,null,null,null,null,null,null,null,null,null,null,null,null,null,null,null,null,null,null,null,null,null,null,null,null,null,null,null,null,null,null,null,null,null,null,null,null,null,null,null,null,null,null,null,null,null,null,null,null,null,null,null,null,null,null,null,null,null,null,null,null,null,null,null,null,null,"MOCOA"]
[null,null,null,null,null,null,null,null,null,null,null,null,null,null,null,null,null,null,null,null,null,null,null,null,null,null,null,null,null,null,null,null,null,null,null,null,null,null,null,null,null,null,null,null,null,null,null,null,null,null,null,null,null,null,null,null,null,null,null,null,null,null,null,null,null,null,null,null,null,null,"ORITO"]
[null,null,null,null,null,null,null,null,null,null,null,null,null,null,null,null,null,null,null,null,null,null,null,null,null,null,null,null,null,null,null,null,null,null,null,null,null,null,null,null,null,null,null,null,null,null,null,null,null,null,null,null,null,null,null,null,null,null,null,null,null,null,null,null,null,null,null,null,null,null,"PUERTO ASIS"]
[null,null,null,null,null,null,null,null,null,null,null,null,null,null,null,null,null,null,null,null,null,null,null,null,null,null,null,null,null,null,null,null,null,null,null,null,null,null,null,null,null,null,null,null,null,null,null,null,null,null,null,null,null,null,null,null,null,null,null,null,null,null,null,null,null,null,null,null,null,null,"PUERTO CAICEDO"]
[null,null,null,null,null,null,null,null,null,null,null,null,null,null,null,null,null,null,null,null,null,null,null,null,null,null,null,null,null,null,null,null,null,null,null,null,null,null,null,null,null,null,null,null,null,null,null,null,null,null,null,null,null,null,null,null,null,null,null,null,null,null,null,null,null,null,null,null,null,null,"PUERTO GUZMAN"]
[null,null,null,null,null,null,null,null,null,null,null,null,null,null,null,null,null,null,null,null,null,null,null,null,null,null,null,null,null,null,null,null,null,null,null,null,null,null,null,null,null,null,null,null,null,null,null,null,null,null,null,null,null,null,null,null,null,null,null,null,null,null,null,null,null,null,null,null,null,null,"SAN FRANCISCO"]
[null,null,null,null,null,null,null,null,null,null,null,null,null,null,null,null,null,null,null,null,null,null,null,null,null,null,null,null,null,null,null,null,null,null,null,null,null,null,null,null,null,null,null,null,null,null,null,null,null,null,null,null,null,null,null,null,null,null,null,null,null,null,null,null,null,null,null,null,null,null,"SAN MIGUEL"]
[null,null,null,null,null,null,null,null,null,null,null,null,null,null,null,null,null,null,null,null,null,null,null,null,null,null,null,null,null,null,null,null,null,null,null,null,null,null,null,null,null,null,null,null,null,null,null,null,null,null,null,null,null,null,null,null,null,null,null,null,null,null,null,null,null,null,null,null,null,null,"SANTIAGO"]
[null,null,null,null,null,null,null,null,null,null,null,null,null,null,null,null,null,null,null,null,null,null,null,null,null,null,null,null,null,null,null,null,null,null,null,null,null,null,null,null,null,null,null,null,null,null,null,null,null,null,null,null,null,null,null,null,null,null,null,null,null,null,null,null,null,null,null,null,null,null,"SIBUNDOY"]
[null,null,null,null,null,null,null,null,null,null,null,null,null,null,null,null,null,null,null,null,null,null,null,null,null,null,null,null,null,null,null,null,null,null,null,null,null,null,null,null,null,null,null,null,null,null,null,null,null,null,null,null,null,null,null,null,null,null,null,null,null,null,null,null,null,null,null,null,null,null,"VALLE DEL GUAMUEZ"]
[null,null,null,null,null,null,null,null,null,null,null,null,null,null,null,null,null,null,null,null,null,null,null,null,null,null,null,null,null,null,null,null,null,null,null,null,null,null,null,null,null,null,null,null,null,null,null,null,null,null,null,null,null,null,null,null,null,null,null,null,null,null,null,null,null,null,null,null,null,null,"VILLAGARZON"]
[null,null,null,null,null,null,null,null,null,null,null,null,null,null,null,null,null,null,null,null,null,null,null,null,null,null,null,null,null,null,null,null,null,null,null,null,null,null,null,null,null,null,null,null,null,null,null,null,null,null,null,null,null,null,null,null,null,null,null,null,null,null,null,null,null,null,null,null,null,null,"ARMENIA"]
[null,null,null,null,null,null,null,null,null,null,null,null,null,null,null,null,null,null,null,null,null,null,null,null,null,null,null,null,null,null,null,null,null,null,null,null,null,null,null,null,null,null,null,null,null,null,null,null,null,null,null,null,null,null,null,null,null,null,null,null,null,null,null,null,null,null,null,null,null,null,"BUENAVISTA"]
[null,null,null,null,null,null,null,null,null,null,null,null,null,null,null,null,null,null,null,null,null,null,null,null,null,null,null,null,null,null,null,null,null,null,null,null,null,null,null,null,null,null,null,null,null,null,null,null,null,null,null,null,null,null,null,null,null,null,null,null,null,null,null,null,null,null,null,null,null,null,"CALARCA"]
[null,null,null,null,null,null,null,null,null,null,null,null,null,null,null,null,null,null,null,null,null,null,null,null,null,null,null,null,null,null,null,null,null,null,null,null,null,null,null,null,null,null,null,null,null,null,null,null,null,null,null,null,null,null,null,null,null,null,null,null,null,null,null,null,null,null,null,null,null,null,"CIRCASIA"]
[null,null,null,null,null,null,null,null,null,null,null,null,null,null,null,null,null,null,null,null,null,null,null,null,null,null,null,null,null,null,null,null,null,null,null,null,null,null,null,null,null,null,null,null,null,null,null,null,null,null,null,null,null,null,null,null,null,null,null,null,null,null,null,null,null,null,null,null,null,null,"CORDOBA"]
[null,null,null,null,null,null,null,null,null,null,null,null,null,null,null,null,null,null,null,null,null,null,null,null,null,null,null,null,null,null,null,null,null,null,null,null,null,null,null,null,null,null,null,null,null,null,null,null,null,null,null,null,null,null,null,null,null,null,null,null,null,null,null,null,null,null,null,null,null,null,"FILANDIA"]
[null,null,null,null,null,null,null,null,null,null,null,null,null,null,null,null,null,null,null,null,null,null,null,null,null,null,null,null,null,null,null,null,null,null,null,null,null,null,null,null,null,null,null,null,null,null,null,null,null,null,null,null,null,null,null,null,null,null,null,null,null,null,null,null,null,null,null,null,null,null,"GENOVA"]
[null,null,null,null,null,null,null,null,null,null,null,null,null,null,null,null,null,null,null,null,null,null,null,null,null,null,null,null,null,null,null,null,null,null,null,null,null,null,null,null,null,null,null,null,null,null,null,null,null,null,null,null,null,null,null,null,null,null,null,null,null,null,null,null,null,null,null,null,null,null,"LA TEBAIDA"]
[null,null,null,null,null,null,null,null,null,null,null,null,null,null,null,null,null,null,null,null,null,null,null,null,null,null,null,null,null,null,null,null,null,null,null,null,null,null,null,null,null,null,null,null,null,null,null,null,null,null,null,null,null,null,null,null,null,null,null,null,null,null,null,null,null,null,null,null,null,null,"MONTENEGRO"]
[null,null,null,null,null,null,null,null,null,null,null,null,null,null,null,null,null,null,null,null,null,null,null,null,null,null,null,null,null,null,null,null,null,null,null,null,null,null,null,null,null,null,null,null,null,null,null,null,null,null,null,null,null,null,null,null,null,null,null,null,null,null,null,null,null,null,null,null,null,null,"PIJAO"]
[null,null,null,null,null,null,null,null,null,null,null,null,null,null,null,null,null,null,null,null,null,null,null,null,null,null,null,null,null,null,null,null,null,null,null,null,null,null,null,null,null,null,null,null,null,null,null,null,null,null,null,null,null,null,null,null,null,null,null,null,null,null,null,null,null,null,null,null,null,null,"QUIMBAYA"]
[null,null,null,null,null,null,null,null,null,null,null,null,null,null,null,null,null,null,null,null,null,null,null,null,null,null,null,null,null,null,null,null,null,null,null,null,null,null,null,null,null,null,null,null,null,null,null,null,null,null,null,null,null,null,null,null,null,null,null,null,null,null,null,null,null,null,null,null,null,null,"SALENTO"]
[null,null,null,null,null,null,null,null,null,null,null,null,null,null,null,null,null,null,null,null,null,null,null,null,null,null,null,null,null,null,null,null,null,null,null,null,null,null,null,null,null,null,null,null,null,null,null,null,null,null,null,null,null,null,null,null,null,null,null,null,null,null,null,null,null,null,null,null,null,null,"APIA"]
[null,null,null,null,null,null,null,null,null,null,null,null,null,null,null,null,null,null,null,null,null,null,null,null,null,null,null,null,null,null,null,null,null,null,null,null,null,null,null,null,null,null,null,null,null,null,null,null,null,null,null,null,null,null,null,null,null,null,null,null,null,null,null,null,null,null,null,null,null,null,"BALBOA"]
[null,null,null,null,null,null,null,null,null,null,null,null,null,null,null,null,null,null,null,null,null,null,null,null,null,null,null,null,null,null,null,null,null,null,null,null,null,null,null,null,null,null,null,null,null,null,null,null,null,null,null,null,null,null,null,null,null,null,null,null,null,null,null,null,null,null,null,null,null,null,"BELEN DE UMBRIA"]
[null,null,null,null,null,null,null,null,null,null,null,null,null,null,null,null,null,null,null,null,null,null,null,null,null,null,null,null,null,null,null,null,null,null,null,null,null,null,null,null,null,null,null,null,null,null,null,null,null,null,null,null,null,null,null,null,null,null,null,null,null,null,null,null,null,null,null,null,null,null,"DOSQUEBRADAS"]
[null,null,null,null,null,null,null,null,null,null,null,null,null,null,null,null,null,null,null,null,null,null,null,null,null,null,null,null,null,null,null,null,null,null,null,null,null,null,null,null,null,null,null,null,null,null,null,null,null,null,null,null,null,null,null,null,null,null,null,null,null,null,null,null,null,null,null,null,null,null,"GUATICA"]
[null,null,null,null,null,null,null,null,null,null,null,null,null,null,null,null,null,null,null,null,null,null,null,null,null,null,null,null,null,null,null,null,null,null,null,null,null,null,null,null,null,null,null,null,null,null,null,null,null,null,null,null,null,null,null,null,null,null,null,null,null,null,null,null,null,null,null,null,null,null,"LA CELIA"]
[null,null,null,null,null,null,null,null,null,null,null,null,null,null,null,null,null,null,null,null,null,null,null,null,null,null,null,null,null,null,null,null,null,null,null,null,null,null,null,null,null,null,null,null,null,null,null,null,null,null,null,null,null,null,null,null,null,null,null,null,null,null,null,null,null,null,null,null,null,null,"LA VIRGINIA"]
[null,null,null,null,null,null,null,null,null,null,null,null,null,null,null,null,null,null,null,null,null,null,null,null,null,null,null,null,null,null,null,null,null,null,null,null,null,null,null,null,null,null,null,null,null,null,null,null,null,null,null,null,null,null,null,null,null,null,null,null,null,null,null,null,null,null,null,null,null,null,"MARSELLA"]
[null,null,null,null,null,null,null,null,null,null,null,null,null,null,null,null,null,null,null,null,null,null,null,null,null,null,null,null,null,null,null,null,null,null,null,null,null,null,null,null,null,null,null,null,null,null,null,null,null,null,null,null,null,null,null,null,null,null,null,null,null,null,null,null,null,null,null,null,null,null,"MISTRATO"]
[null,null,null,null,null,null,null,null,null,null,null,null,null,null,null,null,null,null,null,null,null,null,null,null,null,null,null,null,null,null,null,null,null,null,null,null,null,null,null,null,null,null,null,null,null,null,null,null,null,null,null,null,null,null,null,null,null,null,null,null,null,null,null,null,null,null,null,null,null,null,"PEREIRA"]
[null,null,null,null,null,null,null,null,null,null,null,null,null,null,null,null,null,null,null,null,null,null,null,null,null,null,null,null,null,null,null,null,null,null,null,null,null,null,null,null,null,null,null,null,null,null,null,null,null,null,null,null,null,null,null,null,null,null,null,null,null,null,null,null,null,null,null,null,null,null,"PUEBLO RICO"]
[null,null,null,null,null,null,null,null,null,null,null,null,null,null,null,null,null,null,null,null,null,null,null,null,null,null,null,null,null,null,null,null,null,null,null,null,null,null,null,null,null,null,null,null,null,null,null,null,null,null,null,null,null,null,null,null,null,null,null,null,null,null,null,null,null,null,null,null,null,null,"QUINCHIA"]
[null,null,null,null,null,null,null,null,null,null,null,null,null,null,null,null,null,null,null,null,null,null,null,null,null,null,null,null,null,null,null,null,null,null,null,null,null,null,null,null,null,null,null,null,null,null,null,null,null,null,null,null,null,null,null,null,null,null,null,null,null,null,null,null,null,null,null,null,null,null,"SANTA ROSA DE CABAL"]
[null,null,null,null,null,null,null,null,null,null,null,null,null,null,null,null,null,null,null,null,null,null,null,null,null,null,null,null,null,null,null,null,null,null,null,null,null,null,null,null,null,null,null,null,null,null,null,null,null,null,null,null,null,null,null,null,null,null,null,null,null,null,null,null,null,null,null,null,null,null,"SANTUARIO"]
[null,null,null,null,null,null,null,null,null,null,null,null,null,null,null,null,null,null,null,null,null,null,null,null,null,null,null,null,null,null,null,null,null,null,null,null,null,null,null,null,null,null,null,null,null,null,null,null,null,null,null,null,null,null,null,null,null,null,null,null,null,null,null,null,null,null,null,null,null,null,"PROVIDENCIA"]
[null,null,null,null,null,null,null,null,null,null,null,null,null,null,null,null,null,null,null,null,null,null,null,null,null,null,null,null,null,null,null,null,null,null,null,null,null,null,null,null,null,null,null,null,null,null,null,null,null,null,null,null,null,null,null,null,null,null,null,null,null,null,null,null,null,null,null,null,null,null,"SAN ANDRES"]
[null,null,null,null,null,null,null,null,null,null,null,null,null,null,null,null,null,null,null,null,null,null,null,null,null,null,null,null,null,null,null,null,null,null,null,null,null,null,null,null,null,null,null,null,null,null,null,null,null,null,null,null,null,null,null,null,null,null,null,null,null,null,null,null,null,null,null,null,null,null,"AGUADA"]
[null,null,null,null,null,null,null,null,null,null,null,null,null,null,null,null,null,null,null,null,null,null,null,null,null,null,null,null,null,null,null,null,null,null,null,null,null,null,null,null,null,null,null,null,null,null,null,null,null,null,null,null,null,null,null,null,null,null,null,null,null,null,null,null,null,null,null,null,null,null,"ALBANIA"]
[null,null,null,null,null,null,null,null,null,null,null,null,null,null,null,null,null,null,null,null,null,null,null,null,null,null,null,null,null,null,null,null,null,null,null,null,null,null,null,null,null,null,null,null,null,null,null,null,null,null,null,null,null,null,null,null,null,null,null,null,null,null,null,null,null,null,null,null,null,null,"ARATOCA"]
[null,null,null,null,null,null,null,null,null,null,null,null,null,null,null,null,null,null,null,null,null,null,null,null,null,null,null,null,null,null,null,null,null,null,null,null,null,null,null,null,null,null,null,null,null,null,null,null,null,null,null,null,null,null,null,null,null,null,null,null,null,null,null,null,null,null,null,null,null,null,"BARBOSA"]
[null,null,null,null,null,null,null,null,null,null,null,null,null,null,null,null,null,null,null,null,null,null,null,null,null,null,null,null,null,null,null,null,null,null,null,null,null,null,null,null,null,null,null,null,null,null,null,null,null,null,null,null,null,null,null,null,null,null,null,null,null,null,null,null,null,null,null,null,null,null,"BARICHARA"]
[null,null,null,null,null,null,null,null,null,null,null,null,null,null,null,null,null,null,null,null,null,null,null,null,null,null,null,null,null,null,null,null,null,null,null,null,null,null,null,null,null,null,null,null,null,null,null,null,null,null,null,null,null,null,null,null,null,null,null,null,null,null,null,null,null,null,null,null,null,null,"BARRANCABERMEJA"]
[null,null,null,null,null,null,null,null,null,null,null,null,null,null,null,null,null,null,null,null,null,null,null,null,null,null,null,null,null,null,null,null,null,null,null,null,null,null,null,null,null,null,null,null,null,null,null,null,null,null,null,null,null,null,null,null,null,null,null,null,null,null,null,null,null,null,null,null,null,null,"BETULIA"]
[null,null,null,null,null,null,null,null,null,null,null,null,null,null,null,null,null,null,null,null,null,null,null,null,null,null,null,null,null,null,null,null,null,null,null,null,null,null,null,null,null,null,null,null,null,null,null,null,null,null,null,null,null,null,null,null,null,null,null,null,null,null,null,null,null,null,null,null,null,null,"BOLIVAR"]
[null,null,null,null,null,null,null,null,null,null,null,null,null,null,null,null,null,null,null,null,null,null,null,null,null,null,null,null,null,null,null,null,null,null,null,null,null,null,null,null,null,null,null,null,null,null,null,null,null,null,null,null,null,null,null,null,null,null,null,null,null,null,null,null,null,null,null,null,null,null,"BUCARAMANGA"]
[null,null,null,null,null,null,null,null,null,null,null,null,null,null,null,null,null,null,null,null,null,null,null,null,null,null,null,null,null,null,null,null,null,null,null,null,null,null,null,null,null,null,null,null,null,null,null,null,null,null,null,null,null,null,null,null,null,null,null,null,null,null,null,null,null,null,null,null,null,null,"CABRERA"]
[null,null,null,null,null,null,null,null,null,null,null,null,null,null,null,null,null,null,null,null,null,null,null,null,null,null,null,null,null,null,null,null,null,null,null,null,null,null,null,null,null,null,null,null,null,null,null,null,null,null,null,null,null,null,null,null,null,null,null,null,null,null,null,null,null,null,null,null,null,null,"CALIFORNIA"]
[null,null,null,null,null,null,null,null,null,null,null,null,null,null,null,null,null,null,null,null,null,null,null,null,null,null,null,null,null,null,null,null,null,null,null,null,null,null,null,null,null,null,null,null,null,null,null,null,null,null,null,null,null,null,null,null,null,null,null,null,null,null,null,null,null,null,null,null,null,null,"CAPITANEJO"]
[null,null,null,null,null,null,null,null,null,null,null,null,null,null,null,null,null,null,null,null,null,null,null,null,null,null,null,null,null,null,null,null,null,null,null,null,null,null,null,null,null,null,null,null,null,null,null,null,null,null,null,null,null,null,null,null,null,null,null,null,null,null,null,null,null,null,null,null,null,null,"CARCASI"]
[null,null,null,null,null,null,null,null,null,null,null,null,null,null,null,null,null,null,null,null,null,null,null,null,null,null,null,null,null,null,null,null,null,null,null,null,null,null,null,null,null,null,null,null,null,null,null,null,null,null,null,null,null,null,null,null,null,null,null,null,null,null,null,null,null,null,null,null,null,null,"CEPITA"]
[null,null,null,null,null,null,null,null,null,null,null,null,null,null,null,null,null,null,null,null,null,null,null,null,null,null,null,null,null,null,null,null,null,null,null,null,null,null,null,null,null,null,null,null,null,null,null,null,null,null,null,null,null,null,null,null,null,null,null,null,null,null,null,null,null,null,null,null,null,null,"CERRITO"]
[null,null,null,null,null,null,null,null,null,null,null,null,null,null,null,null,null,null,null,null,null,null,null,null,null,null,null,null,null,null,null,null,null,null,null,null,null,null,null,null,null,null,null,null,null,null,null,null,null,null,null,null,null,null,null,null,null,null,null,null,null,null,null,null,null,null,null,null,null,null,"CHARALA"]
[null,null,null,null,null,null,null,null,null,null,null,null,null,null,null,null,null,null,null,null,null,null,null,null,null,null,null,null,null,null,null,null,null,null,null,null,null,null,null,null,null,null,null,null,null,null,null,null,null,null,null,null,null,null,null,null,null,null,null,null,null,null,null,null,null,null,null,null,null,null,"CHARTA"]
[null,null,null,null,null,null,null,null,null,null,null,null,null,null,null,null,null,null,null,null,null,null,null,null,null,null,null,null,null,null,null,null,null,null,null,null,null,null,null,null,null,null,null,null,null,null,null,null,null,null,null,null,null,null,null,null,null,null,null,null,null,null,null,null,null,null,null,null,null,null,"CHIMA"]
[null,null,null,null,null,null,null,null,null,null,null,null,null,null,null,null,null,null,null,null,null,null,null,null,null,null,null,null,null,null,null,null,null,null,null,null,null,null,null,null,null,null,null,null,null,null,null,null,null,null,null,null,null,null,null,null,null,null,null,null,null,null,null,null,null,null,null,null,null,null,"CHIPATA"]
[null,null,null,null,null,null,null,null,null,null,null,null,null,null,null,null,null,null,null,null,null,null,null,null,null,null,null,null,null,null,null,null,null,null,null,null,null,null,null,null,null,null,null,null,null,null,null,null,null,null,null,null,null,null,null,null,null,null,null,null,null,null,null,null,null,null,null,null,null,null,"CIMITARRA"]
[null,null,null,null,null,null,null,null,null,null,null,null,null,null,null,null,null,null,null,null,null,null,null,null,null,null,null,null,null,null,null,null,null,null,null,null,null,null,null,null,null,null,null,null,null,null,null,null,null,null,null,null,null,null,null,null,null,null,null,null,null,null,null,null,null,null,null,null,null,null,"CONCEPCION"]
[null,null,null,null,null,null,null,null,null,null,null,null,null,null,null,null,null,null,null,null,null,null,null,null,null,null,null,null,null,null,null,null,null,null,null,null,null,null,null,null,null,null,null,null,null,null,null,null,null,null,null,null,null,null,null,null,null,null,null,null,null,null,null,null,null,null,null,null,null,null,"CONFINES"]
[null,null,null,null,null,null,null,null,null,null,null,null,null,null,null,null,null,null,null,null,null,null,null,null,null,null,null,null,null,null,null,null,null,null,null,null,null,null,null,null,null,null,null,null,null,null,null,null,null,null,null,null,null,null,null,null,null,null,null,null,null,null,null,null,null,null,null,null,null,null,"CONTRATACION"]
[null,null,null,null,null,null,null,null,null,null,null,null,null,null,null,null,null,null,null,null,null,null,null,null,null,null,null,null,null,null,null,null,null,null,null,null,null,null,null,null,null,null,null,null,null,null,null,null,null,null,null,null,null,null,null,null,null,null,null,null,null,null,null,null,null,null,null,null,null,null,"COROMORO"]
[null,null,null,null,null,null,null,null,null,null,null,null,null,null,null,null,null,null,null,null,null,null,null,null,null,null,null,null,null,null,null,null,null,null,null,null,null,null,null,null,null,null,null,null,null,null,null,null,null,null,null,null,null,null,null,null,null,null,null,null,null,null,null,null,null,null,null,null,null,null,"CURITI"]
[null,null,null,null,null,null,null,null,null,null,null,null,null,null,null,null,null,null,null,null,null,null,null,null,null,null,null,null,null,null,null,null,null,null,null,null,null,null,null,null,null,null,null,null,null,null,null,null,null,null,null,null,null,null,null,null,null,null,null,null,null,null,null,null,null,null,null,null,null,null,"EL CARMEN DE CHUCURI"]
[null,null,null,null,null,null,null,null,null,null,null,null,null,null,null,null,null,null,null,null,null,null,null,null,null,null,null,null,null,null,null,null,null,null,null,null,null,null,null,null,null,null,null,null,null,null,null,null,null,null,null,null,null,null,null,null,null,null,null,null,null,null,null,null,null,null,null,null,null,null,"EL GUACAMAYO"]
[null,null,null,null,null,null,null,null,null,null,null,null,null,null,null,null,null,null,null,null,null,null,null,null,null,null,null,null,null,null,null,null,null,null,null,null,null,null,null,null,null,null,null,null,null,null,null,null,null,null,null,null,null,null,null,null,null,null,null,null,null,null,null,null,null,null,null,null,null,null,"EL PEÑON"]
[null,null,null,null,null,null,null,null,null,null,null,null,null,null,null,null,null,null,null,null,null,null,null,null,null,null,null,null,null,null,null,null,null,null,null,null,null,null,null,null,null,null,null,null,null,null,null,null,null,null,null,null,null,null,null,null,null,null,null,null,null,null,null,null,null,null,null,null,null,null,"EL PLAYON"]
[null,null,null,null,null,null,null,null,null,null,null,null,null,null,null,null,null,null,null,null,null,null,null,null,null,null,null,null,null,null,null,null,null,null,null,null,null,null,null,null,null,null,null,null,null,null,null,null,null,null,null,null,null,null,null,null,null,null,null,null,null,null,null,null,null,null,null,null,null,null,"ENCINO"]
[null,null,null,null,null,null,null,null,null,null,null,null,null,null,null,null,null,null,null,null,null,null,null,null,null,null,null,null,null,null,null,null,null,null,null,null,null,null,null,null,null,null,null,null,null,null,null,null,null,null,null,null,null,null,null,null,null,null,null,null,null,null,null,null,null,null,null,null,null,null,"ENCISO"]
[null,null,null,null,null,null,null,null,null,null,null,null,null,null,null,null,null,null,null,null,null,null,null,null,null,null,null,null,null,null,null,null,null,null,null,null,null,null,null,null,null,null,null,null,null,null,null,null,null,null,null,null,null,null,null,null,null,null,null,null,null,null,null,null,null,null,null,null,null,null,"FLORIAN"]
[null,null,null,null,null,null,null,null,null,null,null,null,null,null,null,null,null,null,null,null,null,null,null,null,null,null,null,null,null,null,null,null,null,null,null,null,null,null,null,null,null,null,null,null,null,null,null,null,null,null,null,null,null,null,null,null,null,null,null,null,null,null,null,null,null,null,null,null,null,null,"FLORIDABLANCA"]
[null,null,null,null,null,null,null,null,null,null,null,null,null,null,null,null,null,null,null,null,null,null,null,null,null,null,null,null,null,null,null,null,null,null,null,null,null,null,null,null,null,null,null,null,null,null,null,null,null,null,null,null,null,null,null,null,null,null,null,null,null,null,null,null,null,null,null,null,null,null,"GALAN"]
[null,null,null,null,null,null,null,null,null,null,null,null,null,null,null,null,null,null,null,null,null,null,null,null,null,null,null,null,null,null,null,null,null,null,null,null,null,null,null,null,null,null,null,null,null,null,null,null,null,null,null,null,null,null,null,null,null,null,null,null,null,null,null,null,null,null,null,null,null,null,"GAMBITA"]
[null,null,null,null,null,null,null,null,null,null,null,null,null,null,null,null,null,null,null,null,null,null,null,null,null,null,null,null,null,null,null,null,null,null,null,null,null,null,null,null,null,null,null,null,null,null,null,null,null,null,null,null,null,null,null,null,null,null,null,null,null,null,null,null,null,null,null,null,null,null,"GIRON"]
[null,null,null,null,null,null,null,null,null,null,null,null,null,null,null,null,null,null,null,null,null,null,null,null,null,null,null,null,null,null,null,null,null,null,null,null,null,null,null,null,null,null,null,null,null,null,null,null,null,null,null,null,null,null,null,null,null,null,null,null,null,null,null,null,null,null,null,null,null,null,"GsEPSA"]
[null,null,null,null,null,null,null,null,null,null,null,null,null,null,null,null,null,null,null,null,null,null,null,null,null,null,null,null,null,null,null,null,null,null,null,null,null,null,null,null,null,null,null,null,null,null,null,null,null,null,null,null,null,null,null,null,null,null,null,null,null,null,null,null,null,null,null,null,null,null,"GUACA"]
[null,null,null,null,null,null,null,null,null,null,null,null,null,null,null,null,null,null,null,null,null,null,null,null,null,null,null,null,null,null,null,null,null,null,null,null,null,null,null,null,null,null,null,null,null,null,null,null,null,null,null,null,null,null,null,null,null,null,null,null,null,null,null,null,null,null,null,null,null,null,"GUADALUPE"]
[null,null,null,null,null,null,null,null,null,null,null,null,null,null,null,null,null,null,null,null,null,null,null,null,null,null,null,null,null,null,null,null,null,null,null,null,null,null,null,null,null,null,null,null,null,null,null,null,null,null,null,null,null,null,null,null,null,null,null,null,null,null,null,null,null,null,null,null,null,null,"GUAPOTA"]
[null,null,null,null,null,null,null,null,null,null,null,null,null,null,null,null,null,null,null,null,null,null,null,null,null,null,null,null,null,null,null,null,null,null,null,null,null,null,null,null,null,null,null,null,null,null,null,null,null,null,null,null,null,null,null,null,null,null,null,null,null,null,null,null,null,null,null,null,null,null,"GUAVATA"]
[null,null,null,null,null,null,null,null,null,null,null,null,null,null,null,null,null,null,null,null,null,null,null,null,null,null,null,null,null,null,null,null,null,null,null,null,null,null,null,null,null,null,null,null,null,null,null,null,null,null,null,null,null,null,null,null,null,null,null,null,null,null,null,null,null,null,null,null,null,null,"HATO"]
[null,null,null,null,null,null,null,null,null,null,null,null,null,null,null,null,null,null,null,null,null,null,null,null,null,null,null,null,null,null,null,null,null,null,null,null,null,null,null,null,null,null,null,null,null,null,null,null,null,null,null,null,null,null,null,null,null,null,null,null,null,null,null,null,null,null,null,null,null,null,"JESUS MARIA"]
[null,null,null,null,null,null,null,null,null,null,null,null,null,null,null,null,null,null,null,null,null,null,null,null,null,null,null,null,null,null,null,null,null,null,null,null,null,null,null,null,null,null,null,null,null,null,null,null,null,null,null,null,null,null,null,null,null,null,null,null,null,null,null,null,null,null,null,null,null,null,"JORDAN"]
[null,null,null,null,null,null,null,null,null,null,null,null,null,null,null,null,null,null,null,null,null,null,null,null,null,null,null,null,null,null,null,null,null,null,null,null,null,null,null,null,null,null,null,null,null,null,null,null,null,null,null,null,null,null,null,null,null,null,null,null,null,null,null,null,null,null,null,null,null,null,"LA BELLEZA"]
[null,null,null,null,null,null,null,null,null,null,null,null,null,null,null,null,null,null,null,null,null,null,null,null,null,null,null,null,null,null,null,null,null,null,null,null,null,null,null,null,null,null,null,null,null,null,null,null,null,null,null,null,null,null,null,null,null,null,null,null,null,null,null,null,null,null,null,null,null,null,"LA PAZ"]
[null,null,null,null,null,null,null,null,null,null,null,null,null,null,null,null,null,null,null,null,null,null,null,null,null,null,null,null,null,null,null,null,null,null,null,null,null,null,null,null,null,null,null,null,null,null,null,null,null,null,null,null,null,null,null,null,null,null,null,null,null,null,null,null,null,null,null,null,null,null,"LANDAZURI"]
[null,null,null,null,null,null,null,null,null,null,null,null,null,null,null,null,null,null,null,null,null,null,null,null,null,null,null,null,null,null,null,null,null,null,null,null,null,null,null,null,null,null,null,null,null,null,null,null,null,null,null,null,null,null,null,null,null,null,null,null,null,null,null,null,null,null,null,null,null,null,"LEBRIJA"]
[null,null,null,null,null,null,null,null,null,null,null,null,null,null,null,null,null,null,null,null,null,null,null,null,null,null,null,null,null,null,null,null,null,null,null,null,null,null,null,null,null,null,null,null,null,null,null,null,null,null,null,null,null,null,null,null,null,null,null,null,null,null,null,null,null,null,null,null,null,null,"LOS SANTOS"]
[null,null,null,null,null,null,null,null,null,null,null,null,null,null,null,null,null,null,null,null,null,null,null,null,null,null,null,null,null,null,null,null,null,null,null,null,null,null,null,null,null,null,null,null,null,null,null,null,null,null,null,null,null,null,null,null,null,null,null,null,null,null,null,null,null,null,null,null,null,null,"MACARAVITA"]
[null,null,null,null,null,null,null,null,null,null,null,null,null,null,null,null,null,null,null,null,null,null,null,null,null,null,null,null,null,null,null,null,null,null,null,null,null,null,null,null,null,null,null,null,null,null,null,null,null,null,null,null,null,null,null,null,null,null,null,null,null,null,null,null,null,null,null,null,null,null,"MALAGA"]
[null,null,null,null,null,null,null,null,null,null,null,null,null,null,null,null,null,null,null,null,null,null,null,null,null,null,null,null,null,null,null,null,null,null,null,null,null,null,null,null,null,null,null,null,null,null,null,null,null,null,null,null,null,null,null,null,null,null,null,null,null,null,null,null,null,null,null,null,null,null,"MATANZA"]
[null,null,null,null,null,null,null,null,null,null,null,null,null,null,null,null,null,null,null,null,null,null,null,null,null,null,null,null,null,null,null,null,null,null,null,null,null,null,null,null,null,null,null,null,null,null,null,null,null,null,null,null,null,null,null,null,null,null,null,null,null,null,null,null,null,null,null,null,null,null,"MOGOTES"]
[null,null,null,null,null,null,null,null,null,null,null,null,null,null,null,null,null,null,null,null,null,null,null,null,null,null,null,null,null,null,null,null,null,null,null,null,null,null,null,null,null,null,null,null,null,null,null,null,null,null,null,null,null,null,null,null,null,null,null,null,null,null,null,null,null,null,null,null,null,null,"MOLAGAVITA"]
[null,null,null,null,null,null,null,null,null,null,null,null,null,null,null,null,null,null,null,null,null,null,null,null,null,null,null,null,null,null,null,null,null,null,null,null,null,null,null,null,null,null,null,null,null,null,null,null,null,null,null,null,null,null,null,null,null,null,null,null,null,null,null,null,null,null,null,null,null,null,"OCAMONTE"]
[null,null,null,null,null,null,null,null,null,null,null,null,null,null,null,null,null,null,null,null,null,null,null,null,null,null,null,null,null,null,null,null,null,null,null,null,null,null,null,null,null,null,null,null,null,null,null,null,null,null,null,null,null,null,null,null,null,null,null,null,null,null,null,null,null,null,null,null,null,null,"OIBA"]
[null,null,null,null,null,null,null,null,null,null,null,null,null,null,null,null,null,null,null,null,null,null,null,null,null,null,null,null,null,null,null,null,null,null,null,null,null,null,null,null,null,null,null,null,null,null,null,null,null,null,null,null,null,null,null,null,null,null,null,null,null,null,null,null,null,null,null,null,null,null,"ONZAGA"]
[null,null,null,null,null,null,null,null,null,null,null,null,null,null,null,null,null,null,null,null,null,null,null,null,null,null,null,null,null,null,null,null,null,null,null,null,null,null,null,null,null,null,null,null,null,null,null,null,null,null,null,null,null,null,null,null,null,null,null,null,null,null,null,null,null,null,null,null,null,null,"PALMAR"]
[null,null,null,null,null,null,null,null,null,null,null,null,null,null,null,null,null,null,null,null,null,null,null,null,null,null,null,null,null,null,null,null,null,null,null,null,null,null,null,null,null,null,null,null,null,null,null,null,null,null,null,null,null,null,null,null,null,null,null,null,null,null,null,null,null,null,null,null,null,null,"PALMAS DEL SOCORRO"]
[null,null,null,null,null,null,null,null,null,null,null,null,null,null,null,null,null,null,null,null,null,null,null,null,null,null,null,null,null,null,null,null,null,null,null,null,null,null,null,null,null,null,null,null,null,null,null,null,null,null,null,null,null,null,null,null,null,null,null,null,null,null,null,null,null,null,null,null,null,null,"PARAMO"]
[null,null,null,null,null,null,null,null,null,null,null,null,null,null,null,null,null,null,null,null,null,null,null,null,null,null,null,null,null,null,null,null,null,null,null,null,null,null,null,null,null,null,null,null,null,null,null,null,null,null,null,null,null,null,null,null,null,null,null,null,null,null,null,null,null,null,null,null,null,null,"PIEDECUESTA"]
[null,null,null,null,null,null,null,null,null,null,null,null,null,null,null,null,null,null,null,null,null,null,null,null,null,null,null,null,null,null,null,null,null,null,null,null,null,null,null,null,null,null,null,null,null,null,null,null,null,null,null,null,null,null,null,null,null,null,null,null,null,null,null,null,null,null,null,null,null,null,"PINCHOTE"]
[null,null,null,null,null,null,null,null,null,null,null,null,null,null,null,null,null,null,null,null,null,null,null,null,null,null,null,null,null,null,null,null,null,null,null,null,null,null,null,null,null,null,null,null,null,null,null,null,null,null,null,null,null,null,null,null,null,null,null,null,null,null,null,null,null,null,null,null,null,null,"PUENTE NACIONAL"]
[null,null,null,null,null,null,null,null,null,null,null,null,null,null,null,null,null,null,null,null,null,null,null,null,null,null,null,null,null,null,null,null,null,null,null,null,null,null,null,null,null,null,null,null,null,null,null,null,null,null,null,null,null,null,null,null,null,null,null,null,null,null,null,null,null,null,null,null,null,null,"PUERTO PARRA"]
[null,null,null,null,null,null,null,null,null,null,null,null,null,null,null,null,null,null,null,null,null,null,null,null,null,null,null,null,null,null,null,null,null,null,null,null,null,null,null,null,null,null,null,null,null,null,null,null,null,null,null,null,null,null,null,null,null,null,null,null,null,null,null,null,null,null,null,null,null,null,"PUERTO WILCHES"]
[null,null,null,null,null,null,null,null,null,null,null,null,null,null,null,null,null,null,null,null,null,null,null,null,null,null,null,null,null,null,null,null,null,null,null,null,null,null,null,null,null,null,null,null,null,null,null,null,null,null,null,null,null,null,null,null,null,null,null,null,null,null,null,null,null,null,null,null,null,null,"RIONEGRO"]
[null,null,null,null,null,null,null,null,null,null,null,null,null,null,null,null,null,null,null,null,null,null,null,null,null,null,null,null,null,null,null,null,null,null,null,null,null,null,null,null,null,null,null,null,null,null,null,null,null,null,null,null,null,null,null,null,null,null,null,null,null,null,null,null,null,null,null,null,null,null,"SABANA DE TORRES"]
[null,null,null,null,null,null,null,null,null,null,null,null,null,null,null,null,null,null,null,null,null,null,null,null,null,null,null,null,null,null,null,null,null,null,null,null,null,null,null,null,null,null,null,null,null,null,null,null,null,null,null,null,null,null,null,null,null,null,null,null,null,null,null,null,null,null,null,null,null,null,"SAN ANDRES"]
[null,null,null,null,null,null,null,null,null,null,null,null,null,null,null,null,null,null,null,null,null,null,null,null,null,null,null,null,null,null,null,null,null,null,null,null,null,null,null,null,null,null,null,null,null,null,null,null,null,null,null,null,null,null,null,null,null,null,null,null,null,null,null,null,null,null,null,null,null,null,"SAN BENITO"]
[null,null,null,null,null,null,null,null,null,null,null,null,null,null,null,null,null,null,null,null,null,null,null,null,null,null,null,null,null,null,null,null,null,null,null,null,null,null,null,null,null,null,null,null,null,null,null,null,null,null,null,null,null,null,null,null,null,null,null,null,null,null,null,null,null,null,null,null,null,null,"SAN GIL"]
[null,null,null,null,null,null,null,null,null,null,null,null,null,null,null,null,null,null,null,null,null,null,null,null,null,null,null,null,null,null,null,null,null,null,null,null,null,null,null,null,null,null,null,null,null,null,null,null,null,null,null,null,null,null,null,null,null,null,null,null,null,null,null,null,null,null,null,null,null,null,"SAN JOAQUIN"]
[null,null,null,null,null,null,null,null,null,null,null,null,null,null,null,null,null,null,null,null,null,null,null,null,null,null,null,null,null,null,null,null,null,null,null,null,null,null,null,null,null,null,null,null,null,null,null,null,null,null,null,null,null,null,null,null,null,null,null,null,null,null,null,null,null,null,null,null,null,null,"SAN JOSE DE MIRANDA"]
[null,null,null,null,null,null,null,null,null,null,null,null,null,null,null,null,null,null,null,null,null,null,null,null,null,null,null,null,null,null,null,null,null,null,null,null,null,null,null,null,null,null,null,null,null,null,null,null,null,null,null,null,null,null,null,null,null,null,null,null,null,null,null,null,null,null,null,null,null,null,"SAN MIGUEL"]
[null,null,null,null,null,null,null,null,null,null,null,null,null,null,null,null,null,null,null,null,null,null,null,null,null,null,null,null,null,null,null,null,null,null,null,null,null,null,null,null,null,null,null,null,null,null,null,null,null,null,null,null,null,null,null,null,null,null,null,null,null,null,null,null,null,null,null,null,null,null,"SAN VICENTE DE CHUCURI"]
[null,null,null,null,null,null,null,null,null,null,null,null,null,null,null,null,null,null,null,null,null,null,null,null,null,null,null,null,null,null,null,null,null,null,null,null,null,null,null,null,null,null,null,null,null,null,null,null,null,null,null,null,null,null,null,null,null,null,null,null,null,null,null,null,null,null,null,null,null,null,"SANTA BARBARA"]
[null,null,null,null,null,null,null,null,null,null,null,null,null,null,null,null,null,null,null,null,null,null,null,null,null,null,null,null,null,null,null,null,null,null,null,null,null,null,null,null,null,null,null,null,null,null,null,null,null,null,null,null,null,null,null,null,null,null,null,null,null,null,null,null,null,null,null,null,null,null,"SANTA HELENA DEL OPON"]
[null,null,null,null,null,null,null,null,null,null,null,null,null,null,null,null,null,null,null,null,null,null,null,null,null,null,null,null,null,null,null,null,null,null,null,null,null,null,null,null,null,null,null,null,null,null,null,null,null,null,null,null,null,null,null,null,null,null,null,null,null,null,null,null,null,null,null,null,null,null,"SIMACOTA"]
[null,null,null,null,null,null,null,null,null,null,null,null,null,null,null,null,null,null,null,null,null,null,null,null,null,null,null,null,null,null,null,null,null,null,null,null,null,null,null,null,null,null,null,null,null,null,null,null,null,null,null,null,null,null,null,null,null,null,null,null,null,null,null,null,null,null,null,null,null,null,"SOCORRO"]
[null,null,null,null,null,null,null,null,null,null,null,null,null,null,null,null,null,null,null,null,null,null,null,null,null,null,null,null,null,null,null,null,null,null,null,null,null,null,null,null,null,null,null,null,null,null,null,null,null,null,null,null,null,null,null,null,null,null,null,null,null,null,null,null,null,null,null,null,null,null,"SUAITA"]
[null,null,null,null,null,null,null,null,null,null,null,null,null,null,null,null,null,null,null,null,null,null,null,null,null,null,null,null,null,null,null,null,null,null,null,null,null,null,null,null,null,null,null,null,null,null,null,null,null,null,null,null,null,null,null,null,null,null,null,null,null,null,null,null,null,null,null,null,null,null,"SUCRE"]
[null,null,null,null,null,null,null,null,null,null,null,null,null,null,null,null,null,null,null,null,null,null,null,null,null,null,null,null,null,null,null,null,null,null,null,null,null,null,null,null,null,null,null,null,null,null,null,null,null,null,null,null,null,null,null,null,null,null,null,null,null,null,null,null,null,null,null,null,null,null,"SURATA"]
[null,null,null,null,null,null,null,null,null,null,null,null,null,null,null,null,null,null,null,null,null,null,null,null,null,null,null,null,null,null,null,null,null,null,null,null,null,null,null,null,null,null,null,null,null,null,null,null,null,null,null,null,null,null,null,null,null,null,null,null,null,null,null,null,null,null,null,null,null,null,"TONA"]
[null,null,null,null,null,null,null,null,null,null,null,null,null,null,null,null,null,null,null,null,null,null,null,null,null,null,null,null,null,null,null,null,null,null,null,null,null,null,null,null,null,null,null,null,null,null,null,null,null,null,null,null,null,null,null,null,null,null,null,null,null,null,null,null,null,null,null,null,null,null,"VALLE DE SAN JOSE"]
[null,null,null,null,null,null,null,null,null,null,null,null,null,null,null,null,null,null,null,null,null,null,null,null,null,null,null,null,null,null,null,null,null,null,null,null,null,null,null,null,null,null,null,null,null,null,null,null,null,null,null,null,null,null,null,null,null,null,null,null,null,null,null,null,null,null,null,null,null,null,"VELEZ"]
[null,null,null,null,null,null,null,null,null,null,null,null,null,null,null,null,null,null,null,null,null,null,null,null,null,null,null,null,null,null,null,null,null,null,null,null,null,null,null,null,null,null,null,null,null,null,null,null,null,null,null,null,null,null,null,null,null,null,null,null,null,null,null,null,null,null,null,null,null,null,"VETAS"]
[null,null,null,null,null,null,null,null,null,null,null,null,null,null,null,null,null,null,null,null,null,null,null,null,null,null,null,null,null,null,null,null,null,null,null,null,null,null,null,null,null,null,null,null,null,null,null,null,null,null,null,null,null,null,null,null,null,null,null,null,null,null,null,null,null,null,null,null,null,null,"VILLANUEVA"]
[null,null,null,null,null,null,null,null,null,null,null,null,null,null,null,null,null,null,null,null,null,null,null,null,null,null,null,null,null,null,null,null,null,null,null,null,null,null,null,null,null,null,null,null,null,null,null,null,null,null,null,null,null,null,null,null,null,null,null,null,null,null,null,null,null,null,null,null,null,null,"ZAPATOCA"]
[null,null,null,null,null,null,null,null,null,null,null,null,null,null,null,null,null,null,null,null,null,null,null,null,null,null,null,null,null,null,null,null,null,null,null,null,null,null,null,null,null,null,null,null,null,null,null,null,null,null,null,null,null,null,null,null,null,null,null,null,null,null,null,null,null,null,null,null,null,null,"BUENAVISTA"]
[null,null,null,null,null,null,null,null,null,null,null,null,null,null,null,null,null,null,null,null,null,null,null,null,null,null,null,null,null,null,null,null,null,null,null,null,null,null,null,null,null,null,null,null,null,null,null,null,null,null,null,null,null,null,null,null,null,null,null,null,null,null,null,null,null,null,null,null,null,null,"CAIMITO"]
[null,null,null,null,null,null,null,null,null,null,null,null,null,null,null,null,null,null,null,null,null,null,null,null,null,null,null,null,null,null,null,null,null,null,null,null,null,null,null,null,null,null,null,null,null,null,null,null,null,null,null,null,null,null,null,null,null,null,null,null,null,null,null,null,null,null,null,null,null,null,"CHALAN"]
[null,null,null,null,null,null,null,null,null,null,null,null,null,null,null,null,null,null,null,null,null,null,null,null,null,null,null,null,null,null,null,null,null,null,null,null,null,null,null,null,null,null,null,null,null,null,null,null,null,null,null,null,null,null,null,null,null,null,null,null,null,null,null,null,null,null,null,null,null,null,"COLOSO"]
[null,null,null,null,null,null,null,null,null,null,null,null,null,null,null,null,null,null,null,null,null,null,null,null,null,null,null,null,null,null,null,null,null,null,null,null,null,null,null,null,null,null,null,null,null,null,null,null,null,null,null,null,null,null,null,null,null,null,null,null,null,null,null,null,null,null,null,null,null,null,"COROZAL"]
[null,null,null,null,null,null,null,null,null,null,null,null,null,null,null,null,null,null,null,null,null,null,null,null,null,null,null,null,null,null,null,null,null,null,null,null,null,null,null,null,null,null,null,null,null,null,null,null,null,null,null,null,null,null,null,null,null,null,null,null,null,null,null,null,null,null,null,null,null,null,"COVEÑAS"]
[null,null,null,null,null,null,null,null,null,null,null,null,null,null,null,null,null,null,null,null,null,null,null,null,null,null,null,null,null,null,null,null,null,null,null,null,null,null,null,null,null,null,null,null,null,null,null,null,null,null,null,null,null,null,null,null,null,null,null,null,null,null,null,null,null,null,null,null,null,null,"EL ROBLE"]
[null,null,null,null,null,null,null,null,null,null,null,null,null,null,null,null,null,null,null,null,null,null,null,null,null,null,null,null,null,null,null,null,null,null,null,null,null,null,null,null,null,null,null,null,null,null,null,null,null,null,null,null,null,null,null,null,null,null,null,null,null,null,null,null,null,null,null,null,null,null,"GALERAS"]
[null,null,null,null,null,null,null,null,null,null,null,null,null,null,null,null,null,null,null,null,null,null,null,null,null,null,null,null,null,null,null,null,null,null,null,null,null,null,null,null,null,null,null,null,null,null,null,null,null,null,null,null,null,null,null,null,null,null,null,null,null,null,null,null,null,null,null,null,null,null,"GUARANDA"]
[null,null,null,null,null,null,null,null,null,null,null,null,null,null,null,null,null,null,null,null,null,null,null,null,null,null,null,null,null,null,null,null,null,null,null,null,null,null,null,null,null,null,null,null,null,null,null,null,null,null,null,null,null,null,null,null,null,null,null,null,null,null,null,null,null,null,null,null,null,null,"LA UNION"]
[null,null,null,null,null,null,null,null,null,null,null,null,null,null,null,null,null,null,null,null,null,null,null,null,null,null,null,null,null,null,null,null,null,null,null,null,null,null,null,null,null,null,null,null,null,null,null,null,null,null,null,null,null,null,null,null,null,null,null,null,null,null,null,null,null,null,null,null,null,null,"LOS PALMITOS"]
[null,null,null,null,null,null,null,null,null,null,null,null,null,null,null,null,null,null,null,null,null,null,null,null,null,null,null,null,null,null,null,null,null,null,null,null,null,null,null,null,null,null,null,null,null,null,null,null,null,null,null,null,null,null,null,null,null,null,null,null,null,null,null,null,null,null,null,null,null,null,"MAJAGUAL"]
[null,null,null,null,null,null,null,null,null,null,null,null,null,null,null,null,null,null,null,null,null,null,null,null,null,null,null,null,null,null,null,null,null,null,null,null,null,null,null,null,null,null,null,null,null,null,null,null,null,null,null,null,null,null,null,null,null,null,null,null,null,null,null,null,null,null,null,null,null,null,"MORROA"]
[null,null,null,null,null,null,null,null,null,null,null,null,null,null,null,null,null,null,null,null,null,null,null,null,null,null,null,null,null,null,null,null,null,null,null,null,null,null,null,null,null,null,null,null,null,null,null,null,null,null,null,null,null,null,null,null,null,null,null,null,null,null,null,null,null,null,null,null,null,null,"OVEJAS"]
[null,null,null,null,null,null,null,null,null,null,null,null,null,null,null,null,null,null,null,null,null,null,null,null,null,null,null,null,null,null,null,null,null,null,null,null,null,null,null,null,null,null,null,null,null,null,null,null,null,null,null,null,null,null,null,null,null,null,null,null,null,null,null,null,null,null,null,null,null,null,"PALMITO"]
[null,null,null,null,null,null,null,null,null,null,null,null,null,null,null,null,null,null,null,null,null,null,null,null,null,null,null,null,null,null,null,null,null,null,null,null,null,null,null,null,null,null,null,null,null,null,null,null,null,null,null,null,null,null,null,null,null,null,null,null,null,null,null,null,null,null,null,null,null,null,"SAMPUES"]
[null,null,null,null,null,null,null,null,null,null,null,null,null,null,null,null,null,null,null,null,null,null,null,null,null,null,null,null,null,null,null,null,null,null,null,null,null,null,null,null,null,null,null,null,null,null,null,null,null,null,null,null,null,null,null,null,null,null,null,null,null,null,null,null,null,null,null,null,null,null,"SAN BENITO ABAD"]
[null,null,null,null,null,null,null,null,null,null,null,null,null,null,null,null,null,null,null,null,null,null,null,null,null,null,null,null,null,null,null,null,null,null,null,null,null,null,null,null,null,null,null,null,null,null,null,null,null,null,null,null,null,null,null,null,null,null,null,null,null,null,null,null,null,null,null,null,null,null,"SAN JUAN DE BETULIA"]
[null,null,null,null,null,null,null,null,null,null,null,null,null,null,null,null,null,null,null,null,null,null,null,null,null,null,null,null,null,null,null,null,null,null,null,null,null,null,null,null,null,null,null,null,null,null,null,null,null,null,null,null,null,null,null,null,null,null,null,null,null,null,null,null,null,null,null,null,null,null,"SAN LUIS DE SINCE"]
[null,null,null,null,null,null,null,null,null,null,null,null,null,null,null,null,null,null,null,null,null,null,null,null,null,null,null,null,null,null,null,null,null,null,null,null,null,null,null,null,null,null,null,null,null,null,null,null,null,null,null,null,null,null,null,null,null,null,null,null,null,null,null,null,null,null,null,null,null,null,"SAN MARCOS"]
[null,null,null,null,null,null,null,null,null,null,null,null,null,null,null,null,null,null,null,null,null,null,null,null,null,null,null,null,null,null,null,null,null,null,null,null,null,null,null,null,null,null,null,null,null,null,null,null,null,null,null,null,null,null,null,null,null,null,null,null,null,null,null,null,null,null,null,null,null,null,"SAN ONOFRE"]
[null,null,null,null,null,null,null,null,null,null,null,null,null,null,null,null,null,null,null,null,null,null,null,null,null,null,null,null,null,null,null,null,null,null,null,null,null,null,null,null,null,null,null,null,null,null,null,null,null,null,null,null,null,null,null,null,null,null,null,null,null,null,null,null,null,null,null,null,null,null,"SAN PEDRO"]
[null,null,null,null,null,null,null,null,null,null,null,null,null,null,null,null,null,null,null,null,null,null,null,null,null,null,null,null,null,null,null,null,null,null,null,null,null,null,null,null,null,null,null,null,null,null,null,null,null,null,null,null,null,null,null,null,null,null,null,null,null,null,null,null,null,null,null,null,null,null,"SANTIAGO DE TOLU"]
[null,null,null,null,null,null,null,null,null,null,null,null,null,null,null,null,null,null,null,null,null,null,null,null,null,null,null,null,null,null,null,null,null,null,null,null,null,null,null,null,null,null,null,null,null,null,null,null,null,null,null,null,null,null,null,null,null,null,null,null,null,null,null,null,null,null,null,null,null,null,"SINCELEJO"]
[null,null,null,null,null,null,null,null,null,null,null,null,null,null,null,null,null,null,null,null,null,null,null,null,null,null,null,null,null,null,null,null,null,null,null,null,null,null,null,null,null,null,null,null,null,null,null,null,null,null,null,null,null,null,null,null,null,null,null,null,null,null,null,null,null,null,null,null,null,null,"SUCRE"]
[null,null,null,null,null,null,null,null,null,null,null,null,null,null,null,null,null,null,null,null,null,null,null,null,null,null,null,null,null,null,null,null,null,null,null,null,null,null,null,null,null,null,null,null,null,null,null,null,null,null,null,null,null,null,null,null,null,null,null,null,null,null,null,null,null,null,null,null,null,null,"TOLU VIEJO"]
[null,null,null,null,null,null,null,null,null,null,null,null,null,null,null,null,null,null,null,null,null,null,null,null,null,null,null,null,null,null,null,null,null,null,null,null,null,null,null,null,null,null,null,null,null,null,null,null,null,null,null,null,null,null,null,null,null,null,null,null,null,null,null,null,null,null,null,null,null,null,"ALPUJARRA"]
[null,null,null,null,null,null,null,null,null,null,null,null,null,null,null,null,null,null,null,null,null,null,null,null,null,null,null,null,null,null,null,null,null,null,null,null,null,null,null,null,null,null,null,null,null,null,null,null,null,null,null,null,null,null,null,null,null,null,null,null,null,null,null,null,null,null,null,null,null,null,"ALVARADO"]
[null,null,null,null,null,null,null,null,null,null,null,null,null,null,null,null,null,null,null,null,null,null,null,null,null,null,null,null,null,null,null,null,null,null,null,null,null,null,null,null,null,null,null,null,null,null,null,null,null,null,null,null,null,null,null,null,null,null,null,null,null,null,null,null,null,null,null,null,null,null,"AMBALEMA"]
[null,null,null,null,null,null,null,null,null,null,null,null,null,null,null,null,null,null,null,null,null,null,null,null,null,null,null,null,null,null,null,null,null,null,null,null,null,null,null,null,null,null,null,null,null,null,null,null,null,null,null,null,null,null,null,null,null,null,null,null,null,null,null,null,null,null,null,null,null,null,"ANZOATEGUI"]
[null,null,null,null,null,null,null,null,null,null,null,null,null,null,null,null,null,null,null,null,null,null,null,null,null,null,null,null,null,null,null,null,null,null,null,null,null,null,null,null,null,null,null,null,null,null,null,null,null,null,null,null,null,null,null,null,null,null,null,null,null,null,null,null,null,null,null,null,null,null,"ARMERO"]
[null,null,null,null,null,null,null,null,null,null,null,null,null,null,null,null,null,null,null,null,null,null,null,null,null,null,null,null,null,null,null,null,null,null,null,null,null,null,null,null,null,null,null,null,null,null,null,null,null,null,null,null,null,null,null,null,null,null,null,null,null,null,null,null,null,null,null,null,null,null,"ATACO"]
[null,null,null,null,null,null,null,null,null,null,null,null,null,null,null,null,null,null,null,null,null,null,null,null,null,null,null,null,null,null,null,null,null,null,null,null,null,null,null,null,null,null,null,null,null,null,null,null,null,null,null,null,null,null,null,null,null,null,null,null,null,null,null,null,null,null,null,null,null,null,"CAJAMARCA"]
[null,null,null,null,null,null,null,null,null,null,null,null,null,null,null,null,null,null,null,null,null,null,null,null,null,null,null,null,null,null,null,null,null,null,null,null,null,null,null,null,null,null,null,null,null,null,null,null,null,null,null,null,null,null,null,null,null,null,null,null,null,null,null,null,null,null,null,null,null,null,"CARMEN DE APICALA"]
[null,null,null,null,null,null,null,null,null,null,null,null,null,null,null,null,null,null,null,null,null,null,null,null,null,null,null,null,null,null,null,null,null,null,null,null,null,null,null,null,null,null,null,null,null,null,null,null,null,null,null,null,null,null,null,null,null,null,null,null,null,null,null,null,null,null,null,null,null,null,"CASABIANCA"]
[null,null,null,null,null,null,null,null,null,null,null,null,null,null,null,null,null,null,null,null,null,null,null,null,null,null,null,null,null,null,null,null,null,null,null,null,null,null,null,null,null,null,null,null,null,null,null,null,null,null,null,null,null,null,null,null,null,null,null,null,null,null,null,null,null,null,null,null,null,null,"CHAPARRAL"]
[null,null,null,null,null,null,null,null,null,null,null,null,null,null,null,null,null,null,null,null,null,null,null,null,null,null,null,null,null,null,null,null,null,null,null,null,null,null,null,null,null,null,null,null,null,null,null,null,null,null,null,null,null,null,null,null,null,null,null,null,null,null,null,null,null,null,null,null,null,null,"COELLO"]
[null,null,null,null,null,null,null,null,null,null,null,null,null,null,null,null,null,null,null,null,null,null,null,null,null,null,null,null,null,null,null,null,null,null,null,null,null,null,null,null,null,null,null,null,null,null,null,null,null,null,null,null,null,null,null,null,null,null,null,null,null,null,null,null,null,null,null,null,null,null,"COYAIMA"]
[null,null,null,null,null,null,null,null,null,null,null,null,null,null,null,null,null,null,null,null,null,null,null,null,null,null,null,null,null,null,null,null,null,null,null,null,null,null,null,null,null,null,null,null,null,null,null,null,null,null,null,null,null,null,null,null,null,null,null,null,null,null,null,null,null,null,null,null,null,null,"CUNDAY"]
[null,null,null,null,null,null,null,null,null,null,null,null,null,null,null,null,null,null,null,null,null,null,null,null,null,null,null,null,null,null,null,null,null,null,null,null,null,null,null,null,null,null,null,null,null,null,null,null,null,null,null,null,null,null,null,null,null,null,null,null,null,null,null,null,null,null,null,null,null,null,"DOLORES"]
[null,null,null,null,null,null,null,null,null,null,null,null,null,null,null,null,null,null,null,null,null,null,null,null,null,null,null,null,null,null,null,null,null,null,null,null,null,null,null,null,null,null,null,null,null,null,null,null,null,null,null,null,null,null,null,null,null,null,null,null,null,null,null,null,null,null,null,null,null,null,"ESPINAL"]
[null,null,null,null,null,null,null,null,null,null,null,null,null,null,null,null,null,null,null,null,null,null,null,null,null,null,null,null,null,null,null,null,null,null,null,null,null,null,null,null,null,null,null,null,null,null,null,null,null,null,null,null,null,null,null,null,null,null,null,null,null,null,null,null,null,null,null,null,null,null,"FALAN"]
[null,null,null,null,null,null,null,null,null,null,null,null,null,null,null,null,null,null,null,null,null,null,null,null,null,null,null,null,null,null,null,null,null,null,null,null,null,null,null,null,null,null,null,null,null,null,null,null,null,null,null,null,null,null,null,null,null,null,null,null,null,null,null,null,null,null,null,null,null,null,"FLANDES"]
[null,null,null,null,null,null,null,null,null,null,null,null,null,null,null,null,null,null,null,null,null,null,null,null,null,null,null,null,null,null,null,null,null,null,null,null,null,null,null,null,null,null,null,null,null,null,null,null,null,null,null,null,null,null,null,null,null,null,null,null,null,null,null,null,null,null,null,null,null,null,"FRESNO"]
[null,null,null,null,null,null,null,null,null,null,null,null,null,null,null,null,null,null,null,null,null,null,null,null,null,null,null,null,null,null,null,null,null,null,null,null,null,null,null,null,null,null,null,null,null,null,null,null,null,null,null,null,null,null,null,null,null,null,null,null,null,null,null,null,null,null,null,null,null,null,"GUAMO"]
[null,null,null,null,null,null,null,null,null,null,null,null,null,null,null,null,null,null,null,null,null,null,null,null,null,null,null,null,null,null,null,null,null,null,null,null,null,null,null,null,null,null,null,null,null,null,null,null,null,null,null,null,null,null,null,null,null,null,null,null,null,null,null,null,null,null,null,null,null,null,"HERVEO"]
[null,null,null,null,null,null,null,null,null,null,null,null,null,null,null,null,null,null,null,null,null,null,null,null,null,null,null,null,null,null,null,null,null,null,null,null,null,null,null,null,null,null,null,null,null,null,null,null,null,null,null,null,null,null,null,null,null,null,null,null,null,null,null,null,null,null,null,null,null,null,"HONDA"]
[null,null,null,null,null,null,null,null,null,null,null,null,null,null,null,null,null,null,null,null,null,null,null,null,null,null,null,null,null,null,null,null,null,null,null,null,null,null,null,null,null,null,null,null,null,null,null,null,null,null,null,null,null,null,null,null,null,null,null,null,null,null,null,null,null,null,null,null,null,null,"IBAGUE"]
[null,null,null,null,null,null,null,null,null,null,null,null,null,null,null,null,null,null,null,null,null,null,null,null,null,null,null,null,null,null,null,null,null,null,null,null,null,null,null,null,null,null,null,null,null,null,null,null,null,null,null,null,null,null,null,null,null,null,null,null,null,null,null,null,null,null,null,null,null,null,"ICONONZO"]
[null,null,null,null,null,null,null,null,null,null,null,null,null,null,null,null,null,null,null,null,null,null,null,null,null,null,null,null,null,null,null,null,null,null,null,null,null,null,null,null,null,null,null,null,null,null,null,null,null,null,null,null,null,null,null,null,null,null,null,null,null,null,null,null,null,null,null,null,null,null,"LERIDA"]
[null,null,null,null,null,null,null,null,null,null,null,null,null,null,null,null,null,null,null,null,null,null,null,null,null,null,null,null,null,null,null,null,null,null,null,null,null,null,null,null,null,null,null,null,null,null,null,null,null,null,null,null,null,null,null,null,null,null,null,null,null,null,null,null,null,null,null,null,null,null,"LIBANO"]
[null,null,null,null,null,null,null,null,null,null,null,null,null,null,null,null,null,null,null,null,null,null,null,null,null,null,null,null,null,null,null,null,null,null,null,null,null,null,null,null,null,null,null,null,null,null,null,null,null,null,null,null,null,null,null,null,null,null,null,null,null,null,null,null,null,null,null,null,null,null,"MARIQUITA"]
[null,null,null,null,null,null,null,null,null,null,null,null,null,null,null,null,null,null,null,null,null,null,null,null,null,null,null,null,null,null,null,null,null,null,null,null,null,null,null,null,null,null,null,null,null,null,null,null,null,null,null,null,null,null,null,null,null,null,null,null,null,null,null,null,null,null,null,null,null,null,"MELGAR"]
[null,null,null,null,null,null,null,null,null,null,null,null,null,null,null,null,null,null,null,null,null,null,null,null,null,null,null,null,null,null,null,null,null,null,null,null,null,null,null,null,null,null,null,null,null,null,null,null,null,null,null,null,null,null,null,null,null,null,null,null,null,null,null,null,null,null,null,null,null,null,"MURILLO"]
[null,null,null,null,null,null,null,null,null,null,null,null,null,null,null,null,null,null,null,null,null,null,null,null,null,null,null,null,null,null,null,null,null,null,null,null,null,null,null,null,null,null,null,null,null,null,null,null,null,null,null,null,null,null,null,null,null,null,null,null,null,null,null,null,null,null,null,null,null,null,"NATAGAIMA"]
[null,null,null,null,null,null,null,null,null,null,null,null,null,null,null,null,null,null,null,null,null,null,null,null,null,null,null,null,null,null,null,null,null,null,null,null,null,null,null,null,null,null,null,null,null,null,null,null,null,null,null,null,null,null,null,null,null,null,null,null,null,null,null,null,null,null,null,null,null,null,"ORTEGA"]
[null,null,null,null,null,null,null,null,null,null,null,null,null,null,null,null,null,null,null,null,null,null,null,null,null,null,null,null,null,null,null,null,null,null,null,null,null,null,null,null,null,null,null,null,null,null,null,null,null,null,null,null,null,null,null,null,null,null,null,null,null,null,null,null,null,null,null,null,null,null,"PALOCABILDO"]
[null,null,null,null,null,null,null,null,null,null,null,null,null,null,null,null,null,null,null,null,null,null,null,null,null,null,null,null,null,null,null,null,null,null,null,null,null,null,null,null,null,null,null,null,null,null,null,null,null,null,null,null,null,null,null,null,null,null,null,null,null,null,null,null,null,null,null,null,null,null,"PIEDRAS"]
[null,null,null,null,null,null,null,null,null,null,null,null,null,null,null,null,null,null,null,null,null,null,null,null,null,null,null,null,null,null,null,null,null,null,null,null,null,null,null,null,null,null,null,null,null,null,null,null,null,null,null,null,null,null,null,null,null,null,null,null,null,null,null,null,null,null,null,null,null,null,"PLANADAS"]
[null,null,null,null,null,null,null,null,null,null,null,null,null,null,null,null,null,null,null,null,null,null,null,null,null,null,null,null,null,null,null,null,null,null,null,null,null,null,null,null,null,null,null,null,null,null,null,null,null,null,null,null,null,null,null,null,null,null,null,null,null,null,null,null,null,null,null,null,null,null,"PRADO"]
[null,null,null,null,null,null,null,null,null,null,null,null,null,null,null,null,null,null,null,null,null,null,null,null,null,null,null,null,null,null,null,null,null,null,null,null,null,null,null,null,null,null,null,null,null,null,null,null,null,null,null,null,null,null,null,null,null,null,null,null,null,null,null,null,null,null,null,null,null,null,"PURIFICACION"]
[null,null,null,null,null,null,null,null,null,null,null,null,null,null,null,null,null,null,null,null,null,null,null,null,null,null,null,null,null,null,null,null,null,null,null,null,null,null,null,null,null,null,null,null,null,null,null,null,null,null,null,null,null,null,null,null,null,null,null,null,null,null,null,null,null,null,null,null,null,null,"RIOBLANCO"]
[null,null,null,null,null,null,null,null,null,null,null,null,null,null,null,null,null,null,null,null,null,null,null,null,null,null,null,null,null,null,null,null,null,null,null,null,null,null,null,null,null,null,null,null,null,null,null,null,null,null,null,null,null,null,null,null,null,null,null,null,null,null,null,null,null,null,null,null,null,null,"RONCESVALLES"]
[null,null,null,null,null,null,null,null,null,null,null,null,null,null,null,null,null,null,null,null,null,null,null,null,null,null,null,null,null,null,null,null,null,null,null,null,null,null,null,null,null,null,null,null,null,null,null,null,null,null,null,null,null,null,null,null,null,null,null,null,null,null,null,null,null,null,null,null,null,null,"ROVIRA"]
[null,null,null,null,null,null,null,null,null,null,null,null,null,null,null,null,null,null,null,null,null,null,null,null,null,null,null,null,null,null,null,null,null,null,null,null,null,null,null,null,null,null,null,null,null,null,null,null,null,null,null,null,null,null,null,null,null,null,null,null,null,null,null,null,null,null,null,null,null,null,"SALDAÑA"]
[null,null,null,null,null,null,null,null,null,null,null,null,null,null,null,null,null,null,null,null,null,null,null,null,null,null,null,null,null,null,null,null,null,null,null,null,null,null,null,null,null,null,null,null,null,null,null,null,null,null,null,null,null,null,null,null,null,null,null,null,null,null,null,null,null,null,null,null,null,null,"SAN ANTONIO"]
[null,null,null,null,null,null,null,null,null,null,null,null,null,null,null,null,null,null,null,null,null,null,null,null,null,null,null,null,null,null,null,null,null,null,null,null,null,null,null,null,null,null,null,null,null,null,null,null,null,null,null,null,null,null,null,null,null,null,null,null,null,null,null,null,null,null,null,null,null,null,"SAN LUIS"]
[null,null,null,null,null,null,null,null,null,null,null,null,null,null,null,null,null,null,null,null,null,null,null,null,null,null,null,null,null,null,null,null,null,null,null,null,null,null,null,null,null,null,null,null,null,null,null,null,null,null,null,null,null,null,null,null,null,null,null,null,null,null,null,null,null,null,null,null,null,null,"SANTA ISABEL"]
[null,null,null,null,null,null,null,null,null,null,null,null,null,null,null,null,null,null,null,null,null,null,null,null,null,null,null,null,null,null,null,null,null,null,null,null,null,null,null,null,null,null,null,null,null,null,null,null,null,null,null,null,null,null,null,null,null,null,null,null,null,null,null,null,null,null,null,null,null,null,"SUAREZ"]
[null,null,null,null,null,null,null,null,null,null,null,null,null,null,null,null,null,null,null,null,null,null,null,null,null,null,null,null,null,null,null,null,null,null,null,null,null,null,null,null,null,null,null,null,null,null,null,null,null,null,null,null,null,null,null,null,null,null,null,null,null,null,null,null,null,null,null,null,null,null,"VALLE DE SAN JUAN"]
[null,null,null,null,null,null,null,null,null,null,null,null,null,null,null,null,null,null,null,null,null,null,null,null,null,null,null,null,null,null,null,null,null,null,null,null,null,null,null,null,null,null,null,null,null,null,null,null,null,null,null,null,null,null,null,null,null,null,null,null,null,null,null,null,null,null,null,null,null,null,"VENADILLO"]
[null,null,null,null,null,null,null,null,null,null,null,null,null,null,null,null,null,null,null,null,null,null,null,null,null,null,null,null,null,null,null,null,null,null,null,null,null,null,null,null,null,null,null,null,null,null,null,null,null,null,null,null,null,null,null,null,null,null,null,null,null,null,null,null,null,null,null,null,null,null,"VILLAHERMOSA"]
[null,null,null,null,null,null,null,null,null,null,null,null,null,null,null,null,null,null,null,null,null,null,null,null,null,null,null,null,null,null,null,null,null,null,null,null,null,null,null,null,null,null,null,null,null,null,null,null,null,null,null,null,null,null,null,null,null,null,null,null,null,null,null,null,null,null,null,null,null,null,"VILLARRICA"]
[null,null,null,null,null,null,null,null,null,null,null,null,null,null,null,null,null,null,null,null,null,null,null,null,null,null,null,null,null,null,null,null,null,null,null,null,null,null,null,null,null,null,null,null,null,null,null,null,null,null,null,null,null,null,null,null,null,null,null,null,null,null,null,null,null,null,null,null,null,null,"ALCALA"]
[null,null,null,null,null,null,null,null,null,null,null,null,null,null,null,null,null,null,null,null,null,null,null,null,null,null,null,null,null,null,null,null,null,null,null,null,null,null,null,null,null,null,null,null,null,null,null,null,null,null,null,null,null,null,null,null,null,null,null,null,null,null,null,null,null,null,null,null,null,null,"ANDALUCIA"]
[null,null,null,null,null,null,null,null,null,null,null,null,null,null,null,null,null,null,null,null,null,null,null,null,null,null,null,null,null,null,null,null,null,null,null,null,null,null,null,null,null,null,null,null,null,null,null,null,null,null,null,null,null,null,null,null,null,null,null,null,null,null,null,null,null,null,null,null,null,null,"ANSERMANUEVO"]
[null,null,null,null,null,null,null,null,null,null,null,null,null,null,null,null,null,null,null,null,null,null,null,null,null,null,null,null,null,null,null,null,null,null,null,null,null,null,null,null,null,null,null,null,null,null,null,null,null,null,null,null,null,null,null,null,null,null,null,null,null,null,null,null,null,null,null,null,null,null,"ARGELIA"]
[null,null,null,null,null,null,null,null,null,null,null,null,null,null,null,null,null,null,null,null,null,null,null,null,null,null,null,null,null,null,null,null,null,null,null,null,null,null,null,null,null,null,null,null,null,null,null,null,null,null,null,null,null,null,null,null,null,null,null,null,null,null,null,null,null,null,null,null,null,null,"BOLIVAR"]
[null,null,null,null,null,null,null,null,null,null,null,null,null,null,null,null,null,null,null,null,null,null,null,null,null,null,null,null,null,null,null,null,null,null,null,null,null,null,null,null,null,null,null,null,null,null,null,null,null,null,null,null,null,null,null,null,null,null,null,null,null,null,null,null,null,null,null,null,null,null,"BUENAVENTURA"]
[null,null,null,null,null,null,null,null,null,null,null,null,null,null,null,null,null,null,null,null,null,null,null,null,null,null,null,null,null,null,null,null,null,null,null,null,null,null,null,null,null,null,null,null,null,null,null,null,null,null,null,null,null,null,null,null,null,null,null,null,null,null,null,null,null,null,null,null,null,null,"BUGALAGRANDE"]
[null,null,null,null,null,null,null,null,null,null,null,null,null,null,null,null,null,null,null,null,null,null,null,null,null,null,null,null,null,null,null,null,null,null,null,null,null,null,null,null,null,null,null,null,null,null,null,null,null,null,null,null,null,null,null,null,null,null,null,null,null,null,null,null,null,null,null,null,null,null,"CAICEDONIA"]
[null,null,null,null,null,null,null,null,null,null,null,null,null,null,null,null,null,null,null,null,null,null,null,null,null,null,null,null,null,null,null,null,null,null,null,null,null,null,null,null,null,null,null,null,null,null,null,null,null,null,null,null,null,null,null,null,null,null,null,null,null,null,null,null,null,null,null,null,null,null,"CALI"]
[null,null,null,null,null,null,null,null,null,null,null,null,null,null,null,null,null,null,null,null,null,null,null,null,null,null,null,null,null,null,null,null,null,null,null,null,null,null,null,null,null,null,null,null,null,null,null,null,null,null,null,null,null,null,null,null,null,null,null,null,null,null,null,null,null,null,null,null,null,null,"CALIMA"]
[null,null,null,null,null,null,null,null,null,null,null,null,null,null,null,null,null,null,null,null,null,null,null,null,null,null,null,null,null,null,null,null,null,null,null,null,null,null,null,null,null,null,null,null,null,null,null,null,null,null,null,null,null,null,null,null,null,null,null,null,null,null,null,null,null,null,null,null,null,null,"CANDELARIA"]
[null,null,null,null,null,null,null,null,null,null,null,null,null,null,null,null,null,null,null,null,null,null,null,null,null,null,null,null,null,null,null,null,null,null,null,null,null,null,null,null,null,null,null,null,null,null,null,null,null,null,null,null,null,null,null,null,null,null,null,null,null,null,null,null,null,null,null,null,null,null,"CARTAGO"]
[null,null,null,null,null,null,null,null,null,null,null,null,null,null,null,null,null,null,null,null,null,null,null,null,null,null,null,null,null,null,null,null,null,null,null,null,null,null,null,null,null,null,null,null,null,null,null,null,null,null,null,null,null,null,null,null,null,null,null,null,null,null,null,null,null,null,null,null,null,null,"DAGUA"]
[null,null,null,null,null,null,null,null,null,null,null,null,null,null,null,null,null,null,null,null,null,null,null,null,null,null,null,null,null,null,null,null,null,null,null,null,null,null,null,null,null,null,null,null,null,null,null,null,null,null,null,null,null,null,null,null,null,null,null,null,null,null,null,null,null,null,null,null,null,null,"EL AGUILA"]
[null,null,null,null,null,null,null,null,null,null,null,null,null,null,null,null,null,null,null,null,null,null,null,null,null,null,null,null,null,null,null,null,null,null,null,null,null,null,null,null,null,null,null,null,null,null,null,null,null,null,null,null,null,null,null,null,null,null,null,null,null,null,null,null,null,null,null,null,null,null,"EL CAIRO"]
[null,null,null,null,null,null,null,null,null,null,null,null,null,null,null,null,null,null,null,null,null,null,null,null,null,null,null,null,null,null,null,null,null,null,null,null,null,null,null,null,null,null,null,null,null,null,null,null,null,null,null,null,null,null,null,null,null,null,null,null,null,null,null,null,null,null,null,null,null,null,"EL CERRITO"]
[null,null,null,null,null,null,null,null,null,null,null,null,null,null,null,null,null,null,null,null,null,null,null,null,null,null,null,null,null,null,null,null,null,null,null,null,null,null,null,null,null,null,null,null,null,null,null,null,null,null,null,null,null,null,null,null,null,null,null,null,null,null,null,null,null,null,null,null,null,null,"EL DOVIO"]
[null,null,null,null,null,null,null,null,null,null,null,null,null,null,null,null,null,null,null,null,null,null,null,null,null,null,null,null,null,null,null,null,null,null,null,null,null,null,null,null,null,null,null,null,null,null,null,null,null,null,null,null,null,null,null,null,null,null,null,null,null,null,null,null,null,null,null,null,null,null,"FLORIDA"]
[null,null,null,null,null,null,null,null,null,null,null,null,null,null,null,null,null,null,null,null,null,null,null,null,null,null,null,null,null,null,null,null,null,null,null,null,null,null,null,null,null,null,null,null,null,null,null,null,null,null,null,null,null,null,null,null,null,null,null,null,null,null,null,null,null,null,null,null,null,null,"GINEBRA"]
[null,null,null,null,null,null,null,null,null,null,null,null,null,null,null,null,null,null,null,null,null,null,null,null,null,null,null,null,null,null,null,null,null,null,null,null,null,null,null,null,null,null,null,null,null,null,null,null,null,null,null,null,null,null,null,null,null,null,null,null,null,null,null,null,null,null,null,null,null,null,"GUACARI"]
[null,null,null,null,null,null,null,null,null,null,null,null,null,null,null,null,null,null,null,null,null,null,null,null,null,null,null,null,null,null,null,null,null,null,null,null,null,null,null,null,null,null,null,null,null,null,null,null,null,null,null,null,null,null,null,null,null,null,null,null,null,null,null,null,null,null,null,null,null,null,"GUADALAJARA DE BUGA"]
[null,null,null,null,null,null,null,null,null,null,null,null,null,null,null,null,null,null,null,null,null,null,null,null,null,null,null,null,null,null,null,null,null,null,null,null,null,null,null,null,null,null,null,null,null,null,null,null,null,null,null,null,null,null,null,null,null,null,null,null,null,null,null,null,null,null,null,null,null,null,"JAMUNDI"]
[null,null,null,null,null,null,null,null,null,null,null,null,null,null,null,null,null,null,null,null,null,null,null,null,null,null,null,null,null,null,null,null,null,null,null,null,null,null,null,null,null,null,null,null,null,null,null,null,null,null,null,null,null,null,null,null,null,null,null,null,null,null,null,null,null,null,null,null,null,null,"LA CUMBRE"]
[null,null,null,null,null,null,null,null,null,null,null,null,null,null,null,null,null,null,null,null,null,null,null,null,null,null,null,null,null,null,null,null,null,null,null,null,null,null,null,null,null,null,null,null,null,null,null,null,null,null,null,null,null,null,null,null,null,null,null,null,null,null,null,null,null,null,null,null,null,null,"LA UNION"]
[null,null,null,null,null,null,null,null,null,null,null,null,null,null,null,null,null,null,null,null,null,null,null,null,null,null,null,null,null,null,null,null,null,null,null,null,null,null,null,null,null,null,null,null,null,null,null,null,null,null,null,null,null,null,null,null,null,null,null,null,null,null,null,null,null,null,null,null,null,null,"LA VICTORIA"]
[null,null,null,null,null,null,null,null,null,null,null,null,null,null,null,null,null,null,null,null,null,null,null,null,null,null,null,null,null,null,null,null,null,null,null,null,null,null,null,null,null,null,null,null,null,null,null,null,null,null,null,null,null,null,null,null,null,null,null,null,null,null,null,null,null,null,null,null,null,null,"OBANDO"]
[null,null,null,null,null,null,null,null,null,null,null,null,null,null,null,null,null,null,null,null,null,null,null,null,null,null,null,null,null,null,null,null,null,null,null,null,null,null,null,null,null,null,null,null,null,null,null,null,null,null,null,null,null,null,null,null,null,null,null,null,null,null,null,null,null,null,null,null,null,null,"PALMIRA"]
[null,null,null,null,null,null,null,null,null,null,null,null,null,null,null,null,null,null,null,null,null,null,null,null,null,null,null,null,null,null,null,null,null,null,null,null,null,null,null,null,null,null,null,null,null,null,null,null,null,null,null,null,null,null,null,null,null,null,null,null,null,null,null,null,null,null,null,null,null,null,"PRADERA"]
[null,null,null,null,null,null,null,null,null,null,null,null,null,null,null,null,null,null,null,null,null,null,null,null,null,null,null,null,null,null,null,null,null,null,null,null,null,null,null,null,null,null,null,null,null,null,null,null,null,null,null,null,null,null,null,null,null,null,null,null,null,null,null,null,null,null,null,null,null,null,"RESTREPO"]
[null,null,null,null,null,null,null,null,null,null,null,null,null,null,null,null,null,null,null,null,null,null,null,null,null,null,null,null,null,null,null,null,null,null,null,null,null,null,null,null,null,null,null,null,null,null,null,null,null,null,null,null,null,null,null,null,null,null,null,null,null,null,null,null,null,null,null,null,null,null,"RIOFRIO"]
[null,null,null,null,null,null,null,null,null,null,null,null,null,null,null,null,null,null,null,null,null,null,null,null,null,null,null,null,null,null,null,null,null,null,null,null,null,null,null,null,null,null,null,null,null,null,null,null,null,null,null,null,null,null,null,null,null,null,null,null,null,null,null,null,null,null,null,null,null,null,"ROLDANILLO"]
[null,null,null,null,null,null,null,null,null,null,null,null,null,null,null,null,null,null,null,null,null,null,null,null,null,null,null,null,null,null,null,null,null,null,null,null,null,null,null,null,null,null,null,null,null,null,null,null,null,null,null,null,null,null,null,null,null,null,null,null,null,null,null,null,null,null,null,null,null,null,"SAN PEDRO"]
[null,null,null,null,null,null,null,null,null,null,null,null,null,null,null,null,null,null,null,null,null,null,null,null,null,null,null,null,null,null,null,null,null,null,null,null,null,null,null,null,null,null,null,null,null,null,null,null,null,null,null,null,null,null,null,null,null,null,null,null,null,null,null,null,null,null,null,null,null,null,"SEVILLA"]
[null,null,null,null,null,null,null,null,null,null,null,null,null,null,null,null,null,null,null,null,null,null,null,null,null,null,null,null,null,null,null,null,null,null,null,null,null,null,null,null,null,null,null,null,null,null,null,null,null,null,null,null,null,null,null,null,null,null,null,null,null,null,null,null,null,null,null,null,null,null,"TORO"]
[null,null,null,null,null,null,null,null,null,null,null,null,null,null,null,null,null,null,null,null,null,null,null,null,null,null,null,null,null,null,null,null,null,null,null,null,null,null,null,null,null,null,null,null,null,null,null,null,null,null,null,null,null,null,null,null,null,null,null,null,null,null,null,null,null,null,null,null,null,null,"TRUJILLO"]
[null,null,null,null,null,null,null,null,null,null,null,null,null,null,null,null,null,null,null,null,null,null,null,null,null,null,null,null,null,null,null,null,null,null,null,null,null,null,null,null,null,null,null,null,null,null,null,null,null,null,null,null,null,null,null,null,null,null,null,null,null,null,null,null,null,null,null,null,null,null,"TULUA"]
[null,null,null,null,null,null,null,null,null,null,null,null,null,null,null,null,null,null,null,null,null,null,null,null,null,null,null,null,null,null,null,null,null,null,null,null,null,null,null,null,null,null,null,null,null,null,null,null,null,null,null,null,null,null,null,null,null,null,null,null,null,null,null,null,null,null,null,null,null,null,"ULLOA"]
[null,null,null,null,null,null,null,null,null,null,null,null,null,null,null,null,null,null,null,null,null,null,null,null,null,null,null,null,null,null,null,null,null,null,null,null,null,null,null,null,null,null,null,null,null,null,null,null,null,null,null,null,null,null,null,null,null,null,null,null,null,null,null,null,null,null,null,null,null,null,"VERSALLES"]
[null,null,null,null,null,null,null,null,null,null,null,null,null,null,null,null,null,null,null,null,null,null,null,null,null,null,null,null,null,null,null,null,null,null,null,null,null,null,null,null,null,null,null,null,null,null,null,null,null,null,null,null,null,null,null,null,null,null,null,null,null,null,null,null,null,null,null,null,null,null,"VIJES"]
[null,null,null,null,null,null,null,null,null,null,null,null,null,null,null,null,null,null,null,null,null,null,null,null,null,null,null,null,null,null,null,null,null,null,null,null,null,null,null,null,null,null,null,null,null,null,null,null,null,null,null,null,null,null,null,null,null,null,null,null,null,null,null,null,null,null,null,null,null,null,"YOTOCO"]
[null,null,null,null,null,null,null,null,null,null,null,null,null,null,null,null,null,null,null,null,null,null,null,null,null,null,null,null,null,null,null,null,null,null,null,null,null,null,null,null,null,null,null,null,null,null,null,null,null,null,null,null,null,null,null,null,null,null,null,null,null,null,null,null,null,null,null,null,null,null,"YUMBO"]
[null,null,null,null,null,null,null,null,null,null,null,null,null,null,null,null,null,null,null,null,null,null,null,null,null,null,null,null,null,null,null,null,null,null,null,null,null,null,null,null,null,null,null,null,null,null,null,null,null,null,null,null,null,null,null,null,null,null,null,null,null,null,null,null,null,null,null,null,null,null,"ZARZAL"]
[null,null,null,null,null,null,null,null,null,null,null,null,null,null,null,null,null,null,null,null,null,null,null,null,null,null,null,null,null,null,null,null,null,null,null,null,null,null,null,null,null,null,null,null,null,null,null,null,null,null,null,null,null,null,null,null,null,null,null,null,null,null,null,null,null,null,null,null,null,null,"CARURU"]
[null,null,null,null,null,null,null,null,null,null,null,null,null,null,null,null,null,null,null,null,null,null,null,null,null,null,null,null,null,null,null,null,null,null,null,null,null,null,null,null,null,null,null,null,null,null,null,null,null,null,null,null,null,null,null,null,null,null,null,null,null,null,null,null,null,null,null,null,null,null,"MITU"]
[null,null,null,null,null,null,null,null,null,null,null,null,null,null,null,null,null,null,null,null,null,null,null,null,null,null,null,null,null,null,null,null,null,null,null,null,null,null,null,null,null,null,null,null,null,null,null,null,null,null,null,null,null,null,null,null,null,null,null,null,null,null,null,null,null,null,null,null,null,null,"PACOA"]
[null,null,null,null,null,null,null,null,null,null,null,null,null,null,null,null,null,null,null,null,null,null,null,null,null,null,null,null,null,null,null,null,null,null,null,null,null,null,null,null,null,null,null,null,null,null,null,null,null,null,null,null,null,null,null,null,null,null,null,null,null,null,null,null,null,null,null,null,null,null,"PAPUNAUA"]
[null,null,null,null,null,null,null,null,null,null,null,null,null,null,null,null,null,null,null,null,null,null,null,null,null,null,null,null,null,null,null,null,null,null,null,null,null,null,null,null,null,null,null,null,null,null,null,null,null,null,null,null,null,null,null,null,null,null,null,null,null,null,null,null,null,null,null,null,null,null,"TARAIRA"]
[null,null,null,null,null,null,null,null,null,null,null,null,null,null,null,null,null,null,null,null,null,null,null,null,null,null,null,null,null,null,null,null,null,null,null,null,null,null,null,null,null,null,null,null,null,null,null,null,null,null,null,null,null,null,null,null,null,null,null,null,null,null,null,null,null,null,null,null,null,null,"YAVARATE"]
[null,null,null,null,null,null,null,null,null,null,null,null,null,null,null,null,null,null,null,null,null,null,null,null,null,null,null,null,null,null,null,null,null,null,null,null,null,null,null,null,null,null,null,null,null,null,null,null,null,null,null,null,null,null,null,null,null,null,null,null,null,null,null,null,null,null,null,null,null,null,"CUMARIBO"]
[null,null,null,null,null,null,null,null,null,null,null,null,null,null,null,null,null,null,null,null,null,null,null,null,null,null,null,null,null,null,null,null,null,null,null,null,null,null,null,null,null,null,null,null,null,null,null,null,null,null,null,null,null,null,null,null,null,null,null,null,null,null,null,null,null,null,null,null,null,null,"LA PRIMAVERA"]
[null,null,null,null,null,null,null,null,null,null,null,null,null,null,null,null,null,null,null,null,null,null,null,null,null,null,null,null,null,null,null,null,null,null,null,null,null,null,null,null,null,null,null,null,null,null,null,null,null,null,null,null,null,null,null,null,null,null,null,null,null,null,null,null,null,null,null,null,null,null,"PUERTO CARREÑO"]
[null,null,null,null,null,null,null,null,null,null,null,null,null,null,null,null,null,null,null,null,null,null,null,null,null,null,null,null,null,null,null,null,null,null,null,null,null,null,null,null,null,null,null,null,null,null,null,null,null,null,null,null,null,null,null,null,null,null,null,null,null,null,null,null,null,null,null,null,null,null,"SANTA ROSALIA"]

{"sheet":"EJEMPLO_OAP","index":1,"n_rows":50,"n_cols":32,"rows_kept":50,"cut":false,"hidden":true,"merged":[[3,0,3,1],[3,2,3,5],[1,6,1,21],[2,6,2,21],[0,0,1,5],[2,0,2,5],[2,22,2,31],[0,22,1,31],[49,6,49,21],[3,6,3,21],[3,22,3,31],[0,6,0,21]]}
["MINISTERIO DE AMBIENTE Y \nDESARROLLO SOSTENIBLE",null,null,null,null,null,"PLAN DE ACCIÓN"]
[null,null,null,null,null,null,"Proceso: Gestión Integrada del portafolio de Planes, Programas y Proyectos"]
["Versión:  4",null,null,null,null,null,"Vigencia: 22/10/2019",null,null,null,null,null,null,null,null,null,null,null,null,null,null,null,"Código: F-E-GIP-02"]
["CADENA  DE VALOR PROYECTO DE INVERSION",null,"RESOLUCIÓN DESAGREGACIÓN PRESUPUESTO MINAMBIENTE",null,null,null,null,null,null,null,null,null,null,null,null,null,null,null,null,null,null,null,"PLANEACIÓN FINANCIERA"]
["NOMBRE  PROYECTO DE INVERSIÓN / REC.\n(Fuente de financiación)","PRODUCTO \n (cadena de valor _ SIIF)","APROPIACIÓN PRODUCTO POR RESOLUCIÓN\nRecurso:   10 ","APROPIACIÓN PRODUCTO POR RESOLUCIÓN\nRecurso:         ","APROPIACIÓN PRODUCTO POR RESOLUCIÓN\nRecurso:       ","APROPIACIÓN PRODUCTO POR RESOLUCIÓN\nRecurso:       ","VIGENCIA","DEPENDENCIA RESPONSABLE","PACTO\n(Plan Nacional de Desarrollo)","LÍNEA ESTRATÉGICA\n(Plan Nacional de Desarrollo)","OBJETIVO\n(Plan Nacional de Desarrollo)","ESTRATEGIA\n(Plan Nacional de Desarrollo)","PROCESO","PLANES DECRETO 612/2018","SITIO WEB","ACTIVIDAD PRINCIPAL\n (objetivo de la cadena de valor)","ACTIVIDAD DESAGREGADA\n (actividad de la cadena de valor)","META \nVIGENCIA 2019","NOMBRE INDICADOR","UNIDAD DE MEDIDA","RESPONSABLE","DESCRIPCIÓN / OBSERVACIÓN","FORTALECIMIENTO DE LOS PROCESOS DE PLANEACION, EVALUACION Y SEGUIMIENTO A LA GESTION ADELANTADA POR EL SECTOR AMBIENTAL NACIONAL","SELECCIONE -> FUENTE FINANCIACIÓN","SELECCIONE -> FUENTE FINANCIACIÓN","SELECCIONE -> FUENTE FINANCIACIÓN","SELECCIONE -> FUENTE FINANCIACIÓN","SELECCIONE -> FUENTE FINANCIACIÓN","SELECCIONE -> FUENTE FINANCIACIÓN","SELECCIONE -> FUENTE FINANCIACIÓN","SELECCIONE -> FUENTE FINANCIACIÓN","SELECCIONE -> FUENTE FINANCIACIÓN"]
["FORTALECIMIENTO DE LOS PROCESOS DE PLANEACION, EVALUACION Y SEGUIMIENTO A LA GESTION ADELANTADA POR EL SECTOR AMBIENTAL NACIONAL","3299-0900-16-3299054-Documentos de Planeación",2590000000,null,null,null,2020,"Oficina Asesora de Planeación","IV. Pacto por la sostenibilidad: producir conservando y conservar produciendo","15.1. Transformación de la Administración pública",null,null,null,null,null,"Coordinar  la formulación de la planeación estratégica sectorial e institucional, realizar seguimiento, análisis y evaluación, de conformidad con las políticas, normas vigentes y la situación ambiental del país"]
["FORTALECIMIENTO DE LOS PROCESOS DE PLANEACION, EVALUACION Y SEGUIMIENTO A LA GESTION ADELANTADA POR EL SECTOR AMBIENTAL NACIONAL","3299-0900-16-3299054-Documentos de Planeación",200000000,null,null,null,2020,"Oficina Asesora de Planeación","IV. Pacto por la sostenibilidad: producir conservando y conservar produciendo","15.1. Transformación de la Administración pública","15.1.2. Mejorar la eficiencia y productividad en la gestión y las capacidades de las entidades públicas de los sectores.","15.1.2.1. Coordinación intra e intersectorial","GESTIÓN INTEGRADA DEL PORTAFOLIO DE PLANES, PROGRAMAS Y PROYECTOS",null,null,"Coordinar  la formulación de la planeación estratégica sectorial e institucional, realizar seguimiento, análisis y evaluación, de conformidad con las políticas, normas vigentes y la situación ambiental del país","Coordinar las formulacion de Planes  de Acción institucional",1,"Planes De Acción O Gestión Formulados.","Número","Jefe Oficina de Planeación",null,200000000]
["FORTALECIMIENTO DE LOS PROCESOS DE PLANEACION, EVALUACION Y SEGUIMIENTO A LA GESTION ADELANTADA POR EL SECTOR AMBIENTAL NACIONAL","3299-0900-16-3299054-Documentos de Planeación",90000000,null,null,null,2020,"Oficina Asesora de Planeación","IV. Pacto por la sostenibilidad: producir conservando y conservar produciendo","15.1. Transformación de la Administración pública","15.1.2. Mejorar la eficiencia y productividad en la gestión y las capacidades de las entidades públicas de los sectores.","15.1.2.1. Coordinación intra e intersectorial","GESTIÓN INTEGRADA DEL PORTAFOLIO DE PLANES, PROGRAMAS Y PROYECTOS",null,null,"Coordinar  la formulación de la planeación estratégica sectorial e institucional, realizar seguimiento, análisis y evaluación, de conformidad con las políticas, normas vigentes y la situación ambiental del país","Realizar seguimiento integral a la gestion sectorial e institucional.",11,"Informes de seguimiento realizados","Número","Jefe Oficina de Planeación",null,90000000]
["FORTALECIMIENTO DE LOS PROCESOS DE PLANEACION, EVALUACION Y SEGUIMIENTO A LA GESTION ADELANTADA POR EL SECTOR AMBIENTAL NACIONAL","3299-0900-16-3299054-Documentos de Planeación",2300000000,null,null,null,2020,"Oficina Asesora de Planeación","IV. Pacto por la sostenibilidad: producir conservando y conservar produciendo","15.1. Transformación de la Administración pública","15.1.2. Mejorar la eficiencia y productividad en la gestión y las capacidades de las entidades públicas de los sectores.","15.1.2.1. Coordinación intra e intersectorial","GESTIÓN INTEGRADA DEL PORTAFOLIO DE PLANES, PROGRAMAS Y PROYECTOS",null,null,"Coordinar  la formulación de la planeación estratégica sectorial e institucional, realizar seguimiento, análisis y evaluación, de conformidad con las políticas, normas vigentes y la situación ambiental del país","Ejecutar actividades del MADS en el contexto nacional e internacional institucional  acorde al principio de transparencia y la búsqueda de la participación ciudadana.",9,"Informes de seguimiento realizados","Número","Jefe Oficina de Planeación",null,2300000000]
["FORTALECIMIENTO DE LOS PROCESOS DE PLANEACION, EVALUACION Y SEGUIMIENTO A LA GESTION ADELANTADA POR EL SECTOR AMBIENTAL NACIONAL","3299-0900-16-3299057-Documentos de lineamientos técnicos",575000000,null,null,null,2020,"Oficina Asesora de Planeación","IV. Pacto por la sostenibilidad: producir conservando y conservar produciendo","15.1. Transformación de la Administración pública",null,null,null,null,null,"Coordinar el proceso de planeación del presupuesto del sector de ambiente y desarrollo sostenible (aportes PGN, Credito externo, donaciones y recursos propios), hacer su seguimiento, análisis y evaluación de la ejecución presupuestal y proyectos financiados con recursos de los diferentes fondos"]
["FORTALECIMIENTO DE LOS PROCESOS DE PLANEACION, EVALUACION Y SEGUIMIENTO A LA GESTION ADELANTADA POR EL SECTOR AMBIENTAL NACIONAL","3299-0900-16-3299057-Documentos de lineamientos técnicos",95000000,null,null,null,2020,"Oficina Asesora de Planeación","IV. Pacto por la sostenibilidad: producir conservando y conservar produciendo","15.1. Transformación de la Administración pública","15.1.2. Mejorar la eficiencia y productividad en la gestión y las capacidades de las entidades públicas de los sectores.","15.1.2.1. Coordinación intra e intersectorial","GESTIÓN INTEGRADA DEL PORTAFOLIO DE PLANES, PROGRAMAS Y PROYECTOS",null,null,"Coordinar el proceso de planeación del presupuesto del sector de ambiente y desarrollo sostenible (aportes PGN, Credito externo, donaciones y recursos propios), hacer su seguimiento, análisis y evaluación de la ejecución presupuestal y proyectos financiados con recursos de los diferentes fondos","Administrar el Fondo de Compensación Ambiental",85,"Porcentaje De Asignación De Recursos Por Convocatoria","Porcentajes","Jefe Oficina de Planeación",null,95000000]
["FORTALECIMIENTO DE LOS PROCESOS DE PLANEACION, EVALUACION Y SEGUIMIENTO A LA GESTION ADELANTADA POR EL SECTOR AMBIENTAL NACIONAL","3299-0900-16-3299057-Documentos de lineamientos técnicos",380000000,null,null,null,2020,"Oficina Asesora de Planeación","IV. Pacto por la sostenibilidad: producir conservando y conservar produciendo","15.1. Transformación de la Administración pública","15.1.2. Mejorar la eficiencia y productividad en la gestión y las capacidades de las entidades públicas de los sectores.","15.1.2.1. Coordinación intra e intersectorial","GESTIÓN INTEGRADA DEL PORTAFOLIO DE PLANES, PROGRAMAS Y PROYECTOS",null,null,"Coordinar el proceso de planeación del presupuesto del sector de ambiente y desarrollo sostenible (aportes PGN, Credito externo, donaciones y recursos propios), hacer su seguimiento, análisis y evaluación de la ejecución presupuestal y proyectos financiados con recursos de los diferentes fondos","Realizar Fortalecimiento profesional y/o técnico, administrativo y financiero para el desarrollo de la gestión integral de recursos de Fondos y SGR",12,"Informes de seguimiento realizados","Número","Jefe Oficina de Planeación",null,380000000]
["FORTALECIMIENTO DE LOS PROCESOS DE PLANEACION, EVALUACION Y SEGUIMIENTO A LA GESTION ADELANTADA POR EL SECTOR AMBIENTAL NACIONAL","3299-0900-16-3299057-Documentos de lineamientos técnicos",95000000,null,null,null,2020,"Oficina Asesora de Planeación","IV. Pacto por la sostenibilidad: producir conservando y conservar produciendo","15.1. Transformación de la Administración pública","15.1.2. Mejorar la eficiencia y productividad en la gestión y las capacidades de las entidades públicas de los sectores.","15.1.2.1. Coordinación intra e intersectorial","GESTIÓN INTEGRADA DEL PORTAFOLIO DE PLANES, PROGRAMAS Y PROYECTOS",null,null,"Coordinar el proceso de planeación del presupuesto del sector de ambiente y desarrollo sostenible (aportes PGN, Credito externo, donaciones y recursos propios), hacer su seguimiento, análisis y evaluación de la ejecución presupuestal y proyectos financiados con recursos de los diferentes fondos","Realizar seguimiento a la ejecución presupuestal",12,"Informes de seguimiento realizados","Número","Jefe Oficina de Planeación",null,95000000]
["FORTALECIMIENTO DE LOS PROCESOS DE PLANEACION, EVALUACION Y SEGUIMIENTO A LA GESTION ADELANTADA POR EL SECTOR AMBIENTAL NACIONAL","3299-0900-16-3299057-Documentos de lineamientos técnicos",5000000,null,null,null,2020,"Oficina Asesora de Planeación","IV. Pacto por la sostenibilidad: producir conservando y conservar produciendo","15.1. Transformación de la Administración pública","15.1.2. Mejorar la eficiencia y productividad en la gestión y las capacidades de las entidades públicas de los sectores.","15.1.2.1. Coordinación intra e intersectorial","GESTIÓN INTEGRADA DEL PORTAFOLIO DE PLANES, PROGRAMAS Y PROYECTOS",null,null,"Coordinar el proceso de planeación del presupuesto del sector de ambiente y desarrollo sostenible (aportes PGN, Credito externo, donaciones y recursos propios), hacer su seguimiento, análisis y evaluación de la ejecución presupuestal y proyectos financiados con recursos de los diferentes fondos","Coordinar la elaboración de instrumentos de presupuesto y programación (MGMP, Anteproyecto Presupuesto, Presupuesto) realizados",2,"Informes de seguimiento realizados","Número","Jefe Oficina de Planeación",null,5000000]
["FORTALECIMIENTO DE LOS PROCESOS DE PLANEACION, EVALUACION Y SEGUIMIENTO A LA GESTION ADELANTADA POR EL SECTOR AMBIENTAL NACIONAL","3299-0900-16-3299056-Documentos normativos",179000000,null,null,null,2020,"Oficina Asesora de Planeación","IV. Pacto por la sostenibilidad: producir conservando y conservar produciendo","15.1. Transformación de la Administración pública",null,null,null,null,null,"Coordinar el proceso de formulación y seguimiento de documentos de políticas públicas que brinden solución o prevengan una situación definida como problemática de competencia del sector"]
["FORTALECIMIENTO DE LOS PROCESOS DE PLANEACION, EVALUACION Y SEGUIMIENTO A LA GESTION ADELANTADA POR EL SECTOR AMBIENTAL NACIONAL","3299-0900-16-3299056-Documentos normativos",90000000,null,null,null,2020,"Oficina Asesora de Planeación","IV. Pacto por la sostenibilidad: producir conservando y conservar produciendo","15.1. Transformación de la Administración pública","15.1.2. Mejorar la eficiencia y productividad en la gestión y las capacidades de las entidades públicas de los sectores.","15.1.2.1. Coordinación intra e intersectorial","GESTIÓN INTEGRADA DEL PORTAFOLIO DE PLANES, PROGRAMAS Y PROYECTOS",null,null,"Coordinar el proceso de formulación y seguimiento de documentos de políticas públicas que brinden solución o prevengan una situación definida como problemática de competencia del sector","Orientar los procesos de formulacion de politicas y documentos Conpes a cargo a del sector",2,"Documentos insumo elaborados","Número","Jefe Oficina de Planeación",null,90000000]
["FORTALECIMIENTO DE LOS PROCESOS DE PLANEACION, EVALUACION Y SEGUIMIENTO A LA GESTION ADELANTADA POR EL SECTOR AMBIENTAL NACIONAL","3299-0900-16-3299056-Documentos normativos",89000000,null,null,null,2020,"Oficina Asesora de Planeación","IV. Pacto por la sostenibilidad: producir conservando y conservar produciendo","15.1. Transformación de la Administración pública","15.1.2. Mejorar la eficiencia y productividad en la gestión y las capacidades de las entidades públicas de los sectores.","15.1.2.1. Coordinación intra e intersectorial","GESTIÓN INTEGRADA DEL PORTAFOLIO DE PLANES, PROGRAMAS Y PROYECTOS",null,null,"Coordinar el proceso de formulación y seguimiento de documentos de políticas públicas que brinden solución o prevengan una situación definida como problemática de competencia del sector","Elaborar Informes de indicadores de iniciativas internacionales",1,"Informes Presentados","Número","Jefe Oficina de Planeación",null,89000000]
["FORTALECIMIENTO DE LOS PROCESOS DE PLANEACION, EVALUACION Y SEGUIMIENTO A LA GESTION ADELANTADA POR EL SECTOR AMBIENTAL NACIONAL","3299-0900-16-3299060-Servicio de implementación sistemas de gestión",273000000,null,null,null,2020,"Oficina Asesora de Planeación","IV. Pacto por la sostenibilidad: producir conservando y conservar produciendo","15.1. Transformación de la Administración pública",null,null,null,null,null,"Coordinar el Sistema Integrado de Gestión y la implementación del Modelo Integrado de Planeación y Gestión"]
["FORTALECIMIENTO DE LOS PROCESOS DE PLANEACION, EVALUACION Y SEGUIMIENTO A LA GESTION ADELANTADA POR EL SECTOR AMBIENTAL NACIONAL","3299-0900-16-3299060-Servicio de implementación sistemas de gestión",70000000,null,null,null,2020,"Oficina Asesora de Planeación","IV. Pacto por la sostenibilidad: producir conservando y conservar produciendo","15.1. Transformación de la Administración pública","15.1.2. Mejorar la eficiencia y productividad en la gestión y las capacidades de las entidades públicas de los sectores.","15.1.2.1. Coordinación intra e intersectorial","GESTIÓN INTEGRADA DEL PORTAFOLIO DE PLANES, PROGRAMAS Y PROYECTOS",null,null,"Coordinar el Sistema Integrado de Gestión y la implementación del Modelo Integrado de Planeación y Gestión","Mantener los sistemas de información que soportarn la operación del Sistema Integrado de Gestión",1,"Sistemas De Información Diseñados, Actualizados O En Funcionamiento","Número","Jefe Oficina de Planeación",null,70000000]
["FORTALECIMIENTO DE LOS PROCESOS DE PLANEACION, EVALUACION Y SEGUIMIENTO A LA GESTION ADELANTADA POR EL SECTOR AMBIENTAL NACIONAL","3299-0900-16-3299060-Servicio de implementación sistemas de gestión",153000000,null,null,null,2020,"Oficina Asesora de Planeación","IV. Pacto por la sostenibilidad: producir conservando y conservar produciendo","15.1. Transformación de la Administración pública","15.1.2. Mejorar la eficiencia y productividad en la gestión y las capacidades de las entidades públicas de los sectores.","15.1.2.1. Coordinación intra e intersectorial","GESTIÓN INTEGRADA DEL PORTAFOLIO DE PLANES, PROGRAMAS Y PROYECTOS",null,null,"Coordinar el Sistema Integrado de Gestión y la implementación del Modelo Integrado de Planeación y Gestión","Coordinar la implementación de las politicas de gestión y desempeño institucional y sectorial de acuerdo a lo establecido en el Modelo Integrado de Planeación y Gestión",2,"Informes Presentados","Número","Jefe Oficina de Planeación",null,153000000]
["FORTALECIMIENTO DE LOS PROCESOS DE PLANEACION, EVALUACION Y SEGUIMIENTO A LA GESTION ADELANTADA POR EL SECTOR AMBIENTAL NACIONAL","3299-0900-16-3299060-Servicio de implementación sistemas de gestión",50000000,null,null,null,2020,"Oficina Asesora de Planeación","IV. Pacto por la sostenibilidad: producir conservando y conservar produciendo","15.1. Transformación de la Administración pública","15.1.2. Mejorar la eficiencia y productividad en la gestión y las capacidades de las entidades públicas de los sectores.","15.1.2.1. Coordinación intra e intersectorial","GESTIÓN INTEGRADA DEL PORTAFOLIO DE PLANES, PROGRAMAS Y PROYECTOS",null,null,"Coordinar el Sistema Integrado de Gestión y la implementación del Modelo Integrado de Planeación y Gestión","Mantener la estrategia de comunicación SOMOS MADS (  Sistema Integrado de Gestión, Modelo Integrado de Planeación y Gestión, Plan Anticorrupción y de Atención al Ciudadano, Ley de Transparencia)",100,"Porcentaje de avance en la ejecución del plan de comunicación","Porcentajes","Jefe Oficina de Planeación",null,50000000]
[]
[]
[]
[]
[]
[]
[]
[]
[]
[]
[]
[]
[]
[]
[]
[]
[]
[]
[]
[]
[]
[]
[]
[]
[]
[]
[]
[]
[null,null,null,null,null,null,null,null,null,null,null,null,null,null,null,null,null,null,null,null,null,null,3617000000,0,null,null,null,null,null,null,null,0]

{"sheet":"FORMATO PLAN DE ACCIÓN","index":2,"n_rows":50,"n_cols":91,"rows_kept":50,"cut":false,"hidden":false,"merged":[[49,7,49,22],[0,0,1,6],[0,81,1,90],[2,0,2,6],[2,81,2,90],[0,7,0,80],[1,7,1,80],[2,7,2,80],[4,41,4,66],[4,67,4,90],[4,0,4,1],[4,2,4,6],[4,7,4,22],[4,23,4,32],[4,33,4,40],[3,0,3,90]]}
["MINISTERIO DE AMBIENTE Y \nDESARROLLO SOSTENIBLE",null,null,null,null,null,null,"Formulación Plan de Acción"]
[null,null,null,null,null,null,null,"Proceso: Gestión Integrada del portafolio de Planes, Programas y Proyectos"]
["Versión: 5",null,null,null,null,null,null,"Vigencia: 21/09/2021",null,null,null,null,null,null,null,null,null,null,null,null,null,null,null,null,null,null,null,null,null,null,null,null,null,null,null,null,null,null,null,null,null,null,null,null,null,null,null,null,null,null,null,null,null,null,null,null,null,null,null,null,null,null,null,null,null,null,null,null,null,null,null,null,null,null,null,null,null,null,null,null,null,"Código: F-E-GIP-02"]
[]
["CADENA  DE VALOR PROYECTO DE INVERSION",null,"RESOLUCIÓN DESAGREGACIÓN PRESUPUESTO MINAMBIENTE",null,null,null,null,"PLANEACIÓN ESTRATÉGICA",null,null,null,null,null,null,null,null,null,null,null,null,null,null,null,"PLANEACIÓN FINANCIERA",null,null,null,null,null,null,null,null,null,"TRAZADORES PRESUPUESTALES",null,null,null,null,null,null,null,"FOCALIZACIÓN DE LA GESTIÓN",null,null,null,null,null,null,null,null,null,null,null,null,null,null,null,null,null,null,null,null,null,null,null,null,null,"PROGRAMACIÓN DE AVANCE ACUMULADO"]
["NOMBRE  PROYECTO DE INVERSIÓN / REC.\n(Fuente de financiación)","PRODUCTO \n (cadena de valor _ SIIF)","APROPIACIÓN PRODUCTO POR RESOLUCIÓN\nRecurso:  11","APROPIACIÓN PRODUCTO POR RESOLUCIÓN\nRecurso:  15","APROPIACIÓN PRODUCTO POR RESOLUCIÓN\nRecurso:  21","APROPIACIÓN PRODUCTO POR RESOLUCIÓN\nRecurso: ","APROPIACIÓN PRODUCTO POR RESOLUCIÓN\nRecurso: ","VIGENCIA","DEPENDENCIA RESPONSABLE","PACTO\n(Plan Nacional de Desarrollo)","LÍNEA ESTRATÉGICA\n(Plan Nacional de Desarrollo)","OBJETIVO\n(Plan Nacional de Desarrollo)","ESTRATEGIA\n(Plan Nacional de Desarrollo)","PROCESO","PLANES DECRETO 612/2018","SITIO WEB","ACTIVIDAD PRINCIPAL\n (objetivo de la cadena de valor)","ACTIVIDAD DESAGREGADA\n (actividad de los productos de la cadena de valor)","META \nVIGENCIA","NOMBRE INDICADOR","UNIDAD DE MEDIDA","RESPONSABLE","DESCRIPCIÓN / OBSERVACIÓN","SELECCIONE -> FUENTE FINANCIACIÓN","SELECCIONE -> FUENTE FINANCIACIÓN","SELECCIONE -> FUENTE FINANCIACIÓN","SELECCIONE -> FUENTE FINANCIACIÓN","SELECCIONE -> FUENTE FINANCIACIÓN","SELECCIONE -> FUENTE FINANCIACIÓN","SELECCIONE -> FUENTE FINANCIACIÓN","SELECCIONE -> FUENTE FINANCIACIÓN","SELECCIONE -> FUENTE FINANCIACIÓN","SELECCIONE -> FUENTE FINANCIACIÓN","CONTRUCCIÓN DE PAZ","GRUPO ÉTNICO\nINDIGENAS","GRUPO ÉTNICO\nAFROS","GRUPO ÉTNICO\nROM","MUJER","OTRO TRAZADOR","OTRO TRAZADOR","OTRO TRAZADOR","META TRANSFORMACIONAL","META PND","POLÍTICA MIPG","GRUPO POBLACIONAL","GENERO","GRUPO ETNICO","DERECHOS HUMANOS","COMPROMISOS ODS","COMPROMISOS OCDE","CATEGORÍAS \nGASTO PÚBLICO AMBIENTAL","CRECIMIENTO_VERDE","SENTENCIAS","CONPES","POLÍTICA AMBIENTAL","PACTO REGIONAL","AGENDA POST-ACUERDO","COMPROMISOS ETNICOS","¿ESTA ACTIVIDAD PROMUEVE LA PARTICIPACIÓN DE GRUPOS DE VALOR?","REGION(ES) PND","DEPARTAMENTO(S)","MUNICIPIO(S)\n(SI APLICA)",null,null,null,null,null,"ENTREGABLE ENERO","PROGRAMACIÓN\nENERO","ENTREGABLE FEBRERO","PROGRAMACIÓN\nFEBRERO","ENTREGABLE MARZO","PROGRAMACIÓN\nMARZO","ENTREGABLE ABRIL","PROGRAMACIÓN\nABRIL","ENTREGABLE MAYO","PROGRAMACIÓN\nMAYO","ENTREGABLE JUNIO","PROGRAMACIÓN\nJUNIO","ENTREGABLE JULIO","PROGRAMACIÓN\nJULIO","ENTREGABLE AGOSTO","PROGRAMACIÓN\nAGOSTO","ENTREGABLE SEPTIEMBRE","PROGRAMACIÓN\nSEPTIEMBRE","ENTREGABLE OCTUBRE","PROGRAMACIÓN\nOCTUBRE","ENTREGABLE NOVIEMBRE","PROGRAMACIÓN\nNOVIEMBRE","ENTREGABLE DICIEMBRE","PROGRAMACIÓN\nDICIEMBRE"]
[null,null,null,null,null,null,null,null,null,null,null,null,null,null,null,null,null,null,null,null,null,null,null,{"$f":"IF(OR(X6=\"SELECCIONE -> FUENTE FINANCIACIÓN\",X6=\"\"),0,VLOOKUP(X6,MENU!$AB$2:$AD$28,3,FALSE)-'FORMATO PLAN DE ACCIÓN'!X50)","v":0},{"$f":"IF(OR(Y6=\"SELECCIONE -> FUENTE FINANCIACIÓN\",Y6=\"\"),0,VLOOKUP(Y6,MENU!$AB$2:$AD$28,3,FALSE)-'FORMATO PLAN DE ACCIÓN'!Y50)","v":0},{"$f":"IF(OR(Z6=\"SELECCIONE -> FUENTE FINANCIACIÓN\",Z6=\"\"),0,VLOOKUP(Z6,MENU!$AB$2:$AD$28,3,FALSE)-'FORMATO PLAN DE ACCIÓN'!Z50)","v":0},{"$f":"IF(OR(AA6=\"SELECCIONE -> FUENTE FINANCIACIÓN\",AA6=\"\"),0,VLOOKUP(AA6,MENU!$AB$2:$AD$28,3,FALSE)-'FORMATO PLAN DE ACCIÓN'!AA50)","v":0},{"$f":"IF(OR(AB6=\"SELECCIONE -> FUENTE FINANCIACIÓN\",AB6=\"\"),0,VLOOKUP(AB6,MENU!$AB$2:$AD$28,3,FALSE)-'FORMATO PLAN DE ACCIÓN'!AB50)","v":0},{"$f":"IF(OR(AC6=\"SELECCIONE -> FUENTE FINANCIACIÓN\",AC6=\"\"),0,VLOOKUP(AC6,MENU!$AB$2:$AD$28,3,FALSE)-'FORMATO PLAN DE ACCIÓN'!AC50)","v":0},{"$f":"IF(OR(AD6=\"SELECCIONE -> FUENTE FINANCIACIÓN\",AD6=\"\"),0,VLOOKUP(AD6,MENU!$AB$2:$AD$28,3,FALSE)-'FORMATO PLAN DE ACCIÓN'!AD50)","v":0},{"$f":"IF(OR(AE6=\"SELECCIONE -> FUENTE FINANCIACIÓN\",AE6=\"\"),0,VLOOKUP(AE6,MENU!$AB$2:$AD$28,3,FALSE)-'FORMATO PLAN DE ACCIÓN'!AE50)","v":0},{"$f":"IF(OR(AF6=\"SELECCIONE -> FUENTE FINANCIACIÓN\",AF6=\"\"),0,VLOOKUP(AF6,MENU!$AB$2:$AD$28,3,FALSE)-'FORMATO PLAN DE ACCIÓN'!AF50)","v":0},{"$f":"IF(OR(AG6=\"SELECCIONE -> FUENTE FINANCIACIÓN\",AG6=\"\"),0,VLOOKUP(AG6,MENU!$AB$2:$AD$28,3,FALSE)-'FORMATO PLAN DE ACCIÓN'!AG50)","v":0},0,0,0,0,0,0,0,0]
[]
[]
[]
[]
[]
[]
[]
[]
[]
[]
[]
[]
[]
[]
[]
[]
[]
[]
[]
[]
[]
[]
[]
[]
[]
[]
[]
[]
[]
[]
[]
[]
[]
[]
[]
[]
[]
[]
[]
[]
[]
[]
[null,null,null,null,null,null,null,"TOTAL",null,null,null,null,null,null,null,null,null,null,null,null,null,null,null,{"$f":"SUM(X8:X49)","v":0},{"$f":"SUM(Y8:Y49)","v":0},0,0,0,0,0,0,0,0,{"$f":"IF(AH7>0,IF(((COUNTIF(AH8:AH49,\">\"&0)))=0,\"Asignación incompleta\",IF(SUM(AH8:AH49)<AH7,\"Asignación incompleta\",\"Asignación Completa\")),\"No Aplica\")","v":"No Aplica"},{"$f":"IF(AI7>0,IF(((COUNTIF(AI8:AI49,\">\"&0)))=0,\"Asignación incompleta\",IF(SUM(AI8:AI49)<AI7,\"Asignación incompleta\",\"Asignación Completa\")),\"No Aplica\")","v":"No Aplica"},{"$f":"IF(AJ7>0,IF(((COUNTIF(AJ8:AJ49,\">\"&0)))=0,\"Asignación incompleta\",IF(SUM(AJ8:AJ49)<AJ7,\"Asignación incompleta\",\"Asignación Completa\")),\"No Aplica\")","v":"No Aplica"},{"$f":"IF(AK7>0,IF(((COUNTIF(AK8:AK49,\">\"&0)))=0,\"Asignación incompleta\",IF(SUM(AK8:AK49)<AK7,\"Asignación incompleta\",\"Asignación Completa\")),\"No Aplica\")","v":"No Aplica"},{"$f":"IF(AL7>0,IF(((COUNTIF(AL8:AL49,\">\"&0)))=0,\"Asignación incompleta\",IF(SUM(AL8:AL49)<AL7,\"Asignación incompleta\",\"Asignación Completa\")),\"No Aplica\")","v":"No Aplica"},{"$f":"IF(AM7>0,IF(((COUNTIF(AM8:AM49,\">\"&0)))=0,\"Asignación incompleta\",IF(SUM(AM8:AM49)<AM7,\"Asignación incompleta\",\"Asignación Completa\")),\"No Aplica\")","v":"No Aplica"},{"$f":"IF(AN7>0,IF(((COUNTIF(AN8:AN49,\">\"&0)))=0,\"Asignación incompleta\",IF(SUM(AN8:AN49)<AN7,\"Asignación incompleta\",\"Asignación Completa\")),\"No Aplica\")","v":"No Aplica"},{"$f":"IF(AO7>0,IF(((COUNTIF(AO8:AO49,\">\"&0)))=0,\"Asignación incompleta\",IF(SUM(AO8:AO49)<AO7,\"Asignación incompleta\",\"Asignación Completa\")),\"No Aplica\")","v":"No Aplica"}]